{"text_format":"1","workbook":"xlsx","n_sheets":10,"sheets":["INGRESO DE DATOS","Choice Global Health Plan","Global Major Medical Health Pla","Global Select Health Plan","Global Premier Health Plan","Global Select PE Health Plan","Global Elite Health Plan","Global Ultimate Health Plan","Resumen tarifas","Tablas"],"not_rendered":{"charts":0,"images":25,"macros":1,"external_links":0,"defined_names":7,"comments":1,"pivot_tables":0},"unopened":[],"bounds":{"document_bytes":16777216,"sheet_cells":100000,"rows_first":2000,"rows_last":500,"rows_between":2000,"halvings":0,"cell_chars":16384,"cell_head_chars":4096},"cells_cut":0,"cells_raw":0,"read":"whole","date_system":"1900"}

{"sheet":"INGRESO DE DATOS","index":0,"n_rows":33,"n_cols":13,"rows_kept":33,"cut":false,"hidden":false,"merged":[[12,9,13,11],[10,0,10,7],[30,1,30,2],[16,1,16,2],[30,3,30,5],[14,3,14,7],[16,5,16,6],[14,1,14,2],[18,1,18,2],[18,5,18,6],[24,0,24,2],[26,0,26,2],[20,5,27,5]]}
[]
[null,null,null,null,null,null,null," "," "]
[]
[]
[]
[null,null,null,null,null,null,null," "," "," "]
[]
[]
[]
[]
["Cotización de Seguro Médico - Bupa Global Health Plans"]
[]
["1. INGRESE LOS DATOS DEL PROPUESTO ASEGURADO :",null,null,null,null,null,null,null,null,"Diligenciar, solo si aplica otros dependientes, incluir edad.\nEdad máxima para otros dependientes hasta 24 años."]
[]
[null,"Nombre del asegurado titular :",null,"JUAN VIDAL",null,null,null,null,null,"Otros dependientes:","ID","Edad"]
[null,null,null,null,null,null,null,null,null,null,1,null,{"$f":"IF(ISBLANK(L16),TRUE,AND(L16 >= 5,L16 <= 50))","v":true}]
[null,"Número de adultos en la póliza : ",null,2,null,"Número de hijos en la póliza :",null,0,null,null,2,null,{"$f":"IF(ISBLANK(L17),TRUE,AND(L17 >= 5,L17 <= 50))","v":true}]
[null,null,null,null,null,null,null,null,null,null,3,null,{"$f":"IF(ISBLANK(L18),TRUE,AND(L18 >= 5,L18 <= 50))","v":true}]
[null," Edad del asegurado titular :",null,30,{"$f":"AND(D19 >= 5,D19 <= 50)","v":true},"Edad del (de la) cónyuge :",null,30,{"$f":"IF(D17>1,AND(H19 >= 5,H19 <= 50),TRUE)","v":true},null,4,null,{"$f":"IF(ISBLANK(L19),TRUE,AND(L19 >= 5,L19 <= 50))","v":true}]
[null,null,null,null,null,null,null,null,null,null,5,null,{"$f":"IF(ISBLANK(L20),TRUE,AND(L20 >= 5,L20 <= 50))","v":true}]
{"$rows_left_out":14}
{"sheet":"Choice Global Health Plan","index":1,"n_rows":68,"n_cols":16,"rows_kept":68,"cut":false,"hidden":false,"merged":[[23,7,23,8],[25,7,25,8],[59,1,59,9],[59,11,59,12],[60,1,60,9],[60,11,60,12],[34,11,34,12],[58,11,58,12],[46,11,46,12],[47,11,47,12],[48,11,48,12],[49,11,49,12],[50,11,50,12],[51,11,51,12],[52,11,52,12],[53,11,53,12],[61,1,61,9],[61,11,61,12],[66,11,66,12],[67,11,67,12],[63,1,63,9],[62,11,62,12],[63,11,63,12],[64,11,64,12],[65,11,65,12],[54,11,54,12],[55,11,55,12],[57,11,57,15],[45,11,45,15],[35,11,35,12],[36,11,36,12],[37,11,37,12],[38,11,38,12],[39,11,39,12],[40,11,40,12],[41,11,41,12],[42,11,42,12],[43,11,43,12],[26,11,26,12],[33,2,33,8],[28,11,28,12],[29,11,29,12],[30,11,30,12],[31,11,31,12],[31,2,31,8],[32,2,32,8],[33,11,33,15],[23,4,23,5],[23,11,23,15],[29,2,29,8],[30,2,30,8],[19,2,19,8],[19,11,19,12],[20,11,20,12],[21,2,21,8],[21,11,21,12],[27,1,27,2],[27,3,27,4],[27,11,27,12],[24,11,24,12],[25,1,25,2],[25,4,25,5],[25,11,25,12],[46,2,50,8],[17,2,17,8],[65,1,67,9],[64,1,64,9],[62,1,62,9],[40,2,40,8],[41,2,41,8],[42,2,42,8],[43,2,43,8],[44,2,44,8],[35,2,35,8],[36,2,36,8],[37,2,37,8],[38,2,38,8],[39,2,39,8],[23,1,23,2]]}
[]
[]
[]
[]
[]
[]
[]
[null,null,null,null,null,null,null,null,null,null,null,null,null," "," "," "]
[]
[]
[]
[null,null,null,null,null,null,null,null,null,null,null,null,null," "," "," "]
[]
[]
[]
[]
[]
[null,"Región:","Zona 1"]
[null,null,null,null,null,null,null,null,null,null,null,null," ",false]
[null,"Nombre del asegurado titular :",{"$f":"+'INGRESO DE DATOS'!$D$15","v":"JUAN VIDAL"},null,null,null,null,null,null,null,null,"Deducibles",null,"PLAN 1","PLAN 2","PLAN 3"]
{"$rows_left_out":49}
{"sheet":"Global Major Medical Health Pla","index":2,"n_rows":77,"n_cols":15,"rows_kept":77,"cut":false,"hidden":false,"merged":[[36,10,36,11],[46,10,46,11],[58,10,58,11],[70,10,70,11],[43,10,43,11],[44,10,44,11],[45,10,45,11],[47,10,47,11],[48,10,48,11],[49,10,49,11],[50,10,50,11],[51,10,51,11],[52,10,52,11],[54,10,54,13],[55,10,55,11],[56,10,56,11],[37,10,37,11],[38,10,38,11],[39,10,39,11],[40,10,40,11],[42,10,42,13],[28,10,28,11],[43,0,44,0],[43,6,44,6],[22,0,22,6],[32,3,32,4],[34,3,34,4],[36,2,36,3],[36,4,36,5],[28,2,28,8],[30,2,30,8],[29,10,29,11],[30,10,30,11],[32,10,32,13],[33,10,33,11],[34,10,34,11],[35,10,35,11],[57,10,57,11],[59,10,59,11],[60,10,60,11],[61,10,61,11],[62,10,62,11],[73,1,74,8],[63,10,63,11],[64,10,64,11],[66,10,66,13],[67,10,67,11],[72,1,72,8],[68,1,68,8],[69,1,69,8],[70,1,70,8],[71,1,71,8],[75,10,75,11],[76,10,76,11],[68,10,68,11],[69,10,69,11],[71,10,71,11],[72,10,72,11],[73,10,73,11],[74,10,74,11]]}
[]
[]
[null,null,null,null,null,null,null,null,null,null,null,null," "," "," "]
[]
[]
[]
[null,null,null,null,null,null,null,null,null,null,null,null," "," "," "]
[]
[]
[]
[]
[]
[]
[]
[]
[]
[]
[]
[]
[]
{"$rows_left_out":58}
{"sheet":"Global Select Health Plan","index":3,"n_rows":81,"n_cols":17,"rows_kept":81,"cut":false,"hidden":false,"merged":[[77,1,78,8],[66,10,66,11],[65,10,65,11],[67,10,67,11],[71,10,71,11],[72,10,72,11],[68,10,68,11],[70,10,70,16],[76,1,76,8],[72,1,72,8],[73,1,73,8],[74,1,74,8],[75,1,75,8],[74,10,74,11],[73,10,73,11],[75,10,75,11],[41,3,41,4],[46,10,46,16],[58,10,58,16],[43,10,43,11],[47,10,47,11],[61,10,61,11],[63,10,63,11],[64,10,64,11],[59,10,59,11],[60,10,60,11],[62,10,62,11],[47,0,48,0],[47,1,48,1],[56,10,56,11],[54,10,54,11],[55,10,55,11],[48,10,48,11],[49,10,49,11],[51,10,51,11],[52,10,52,11],[53,10,53,11],[50,10,50,11],[22,0,22,1],[44,10,44,11],[28,0,28,1],[32,10,32,11],[38,10,38,11],[32,2,32,8],[34,2,34,8],[33,10,33,11],[34,10,34,11],[37,10,37,11],[39,10,39,11],[36,10,36,16],[41,10,41,11],[42,10,42,11],[40,10,40,11],[41,1,41,2],[80,10,80,11],[76,10,76,11],[77,10,77,11],[78,10,78,11],[79,10,79,11]]}
[]
[]
[null,null,null,null,null,null,null,null,null,null,null,null," "," "," "]
[]
[]
[]
[null,null,null,null,null,null,null,null,null,null,null,null," "," "," "]
[]
[]
[]
[]
[]
[]
[]
[]
[]
[]
[]
[]
[]
{"$rows_left_out":62}
{"sheet":"Global Premier Health Plan","index":4,"n_rows":84,"n_cols":17,"rows_kept":84,"cut":false,"hidden":false,"merged":[[76,1,76,8],[77,1,77,8],[78,1,78,8],[75,11,75,12],[76,11,76,12],[78,11,78,12],[77,11,77,12],[69,11,69,12],[70,11,70,12],[59,11,59,12],[65,11,65,12],[74,11,74,12],[73,11,73,16],[43,1,43,2],[43,3,43,4],[46,11,46,12],[50,1,51,1],[68,11,68,12],[50,11,50,12],[51,11,51,12],[52,11,52,12],[47,11,47,12],[53,11,53,12],[43,11,43,12],[40,11,40,12],[41,11,41,12],[42,11,42,12],[44,11,44,12],[45,11,45,12],[35,11,35,12],[39,11,39,16],[35,2,35,8],[37,2,37,8],[36,11,36,12],[37,11,37,12],[50,0,51,0],[25,0,25,1],[71,11,71,12],[83,11,83,12],[49,11,49,16],[61,11,61,16],[54,11,54,12],[55,11,55,12],[56,11,56,12],[57,11,57,12],[58,11,58,12],[62,11,62,12],[63,11,63,12],[64,11,64,12],[66,11,66,12],[67,11,67,12],[79,11,79,12],[80,11,80,12],[81,11,81,12],[82,11,82,12],[80,1,80,8],[79,1,79,8],[81,1,82,8]]}
[]
[]
[]
[]
[]
[null,null,null,null,null,null,null,null,null,null,null,null,null," "," "," "]
[]
[]
[]
[null,null,null,null,null,null,null,null,null,null,null,null,null," "," "," "]
[]
[]
[]
[]
[]
[]
[]
[]
[]
[]
{"$rows_left_out":65}
{"sheet":"Global Select PE Health Plan","index":5,"n_rows":81,"n_cols":17,"rows_kept":81,"cut":false,"hidden":false,"merged":[[50,10,50,11],[52,10,52,11],[63,10,63,11],[69,1,69,8],[78,1,78,8],[60,10,60,11],[61,10,61,11],[56,10,56,11],[51,10,51,11],[54,10,54,11],[55,10,55,11],[65,10,65,11],[75,1,75,8],[76,1,76,8],[68,10,68,11],[64,10,64,11],[73,1,73,7],[80,10,80,11],[72,10,72,11],[73,10,73,11],[75,10,75,11],[76,10,76,11],[77,10,77,11],[78,10,78,11],[74,10,74,11],[79,1,80,8],[41,3,41,4],[79,10,79,11],[71,10,71,11],[58,10,58,16],[59,10,59,11],[68,1,68,8],[77,1,77,8],[53,10,53,11],[74,1,74,8],[66,10,66,11],[67,10,67,11],[62,10,62,11],[70,10,70,16],[70,1,70,7],[71,1,71,7],[72,1,72,7],[34,2,34,8],[34,10,34,11],[22,0,22,1],[28,0,28,1],[32,2,32,8],[32,10,32,11],[33,10,33,11],[47,0,48,0],[47,1,48,1],[48,10,48,11],[49,10,49,11],[36,10,36,16],[37,10,37,11],[38,10,38,11],[39,10,39,11],[41,10,41,11],[42,10,42,11],[43,10,43,11],[44,10,44,11],[46,10,46,16],[47,10,47,11],[40,10,40,11],[41,1,41,2]]}
[]
[]
[null,null,null,null,null,null,null,null,null,null,null,null," "," "," "]
[]
[]
[]
[null,null,null,null,null,null,null,null,null,null,null,null," "," "," "]
[]
[]
[]
[]
[]
[]
[]
[]
[]
[]
[]
[]
[]
{"$rows_left_out":62}
{"sheet":"Global Elite Health Plan","index":6,"n_rows":74,"n_cols":57,"rows_kept":74,"cut":false,"hidden":false,"merged":[[33,1,33,2],[33,3,33,4],[69,1,69,8],[45,10,45,11],[46,10,46,11],[47,10,47,11],[59,10,59,11],[40,2,41,2],[37,10,37,11],[36,10,36,11],[39,10,39,16],[40,1,41,1],[40,10,40,11],[41,10,41,11],[64,10,64,11],[63,10,63,16],[65,1,65,8],[66,1,66,8],[67,1,67,8],[68,1,68,8],[70,1,71,8],[72,10,72,11],[73,10,73,11],[52,10,52,11],[56,10,56,11],[57,10,57,11],[58,10,58,11],[65,10,65,11],[66,10,66,11],[68,10,68,11],[67,10,67,11],[69,10,69,11],[70,10,70,11],[71,10,71,11],[55,10,55,11],[60,10,60,11],[61,10,61,11],[25,2,25,8],[27,2,27,8],[29,10,29,16],[27,10,27,11],[26,10,26,11],[25,10,25,11],[29,4,29,5],[31,4,31,5],[31,1,31,2],[29,1,29,2],[30,10,30,11],[31,10,31,11],[54,10,54,11],[53,10,53,11],[43,10,43,11],[33,10,33,11],[32,10,32,11],[34,10,34,11],[35,10,35,11],[51,10,51,16],[44,10,44,11],[48,10,48,11],[42,10,42,11],[49,10,49,11]]}
[]
[]
[]
[]
[]
[]
[]
[]
[null,null,null,null,null,null,null,null,null,null,null,null,null,null,null,null,null,null,null,null,null,null,null,null,null,null,null,null,null,null,null,null,null,null,null,null,null,null,null,null,null,null,null,null,null,null,null,null,null,null,null,null,null,null,null,null," "]
[]
[]
[]
[null,null,null,null,null,null,null,null,null,null,null,null,null," "," "," "]
[]
[]
[]
[]
[]
[]
[]
{"$rows_left_out":55}
{"sheet":"Global Ultimate Health Plan","index":7,"n_rows":68,"n_cols":16,"rows_kept":68,"cut":false,"hidden":false,"merged":[[51,11,51,12],[52,11,52,12],[67,11,67,12],[53,11,53,12],[54,11,54,12],[55,11,55,12],[58,11,58,12],[59,11,59,12],[57,11,57,15],[60,11,60,12],[62,11,62,12],[63,11,63,12],[64,11,64,12],[65,11,65,12],[61,11,61,12],[63,1,63,9],[59,1,59,9],[60,1,60,9],[61,1,61,9],[62,1,62,9],[47,11,47,12],[48,11,48,12],[50,11,50,12],[35,6,36,6],[35,7,36,7],[45,11,45,15],[38,11,38,12],[39,11,39,12],[40,11,40,12],[41,11,41,12],[42,11,42,12],[43,11,43,12],[49,11,49,12],[46,11,46,12],[33,11,33,15],[37,11,37,12],[27,1,27,2],[27,3,27,4],[30,11,30,12],[27,11,27,12],[29,11,29,12],[31,11,31,12],[34,11,34,12],[35,11,35,12],[36,11,36,12],[64,1,65,9],[66,11,66,12],[23,4,23,5],[25,4,25,5],[19,2,19,8],[21,2,21,8],[23,1,23,2],[25,1,25,2],[25,11,25,12],[26,11,26,12],[19,11,19,12],[20,11,20,12],[21,11,21,12],[24,11,24,12],[23,11,23,15],[28,11,28,12]]}
[]
[]
[]
[]
[]
[]
[]
[null,null,null,null,null,null,null,null,null,null,null,null,null," "," "," "]
[]
[]
[]
[null,null,null,null,null,null,null,null,null,null,null,null,null," "," "," "]
[]
[]
[]
[]
[]
[]
[null,null,null,null,null,null,null,null,null,null,null,null," ",false]
[null,"Nombre del asegurado titular :",{"$f":"+'INGRESO DE DATOS'!$D$15","v":"JUAN VIDAL"},null,null,null,null,null,null,null,null,"Deducibles",null,"PLAN 1","PLAN 2","PLAN 3"]
{"$rows_left_out":49}
{"sheet":"Resumen tarifas","index":8,"n_rows":139,"n_cols":8,"rows_kept":139,"cut":false,"hidden":false,"merged":[[125,2,125,4],[127,2,127,4],[129,2,129,4],[131,2,131,4],[122,0,122,1],[36,2,36,4],[38,2,38,4],[40,2,40,4],[42,2,42,4],[51,2,51,6],[53,2,53,6],[55,2,55,6],[62,2,62,5],[62,0,62,1],[63,0,63,1],[66,0,66,1],[78,2,78,6],[80,2,80,6],[82,2,82,6],[87,0,87,1],[90,0,90,1],[90,2,90,6],[86,0,86,2],[96,0,96,1],[136,0,136,6],[46,0,46,1],[55,0,55,1],[56,0,56,1],[49,0,49,1],[50,0,50,1],[51,0,51,1],[52,0,52,1],[53,0,53,1],[54,0,54,1],[69,0,69,1],[73,0,73,1],[76,0,76,1],[64,2,64,5],[66,2,66,5],[68,2,68,5],[76,2,76,6],[68,0,68,1],[64,0,64,1],[65,0,65,1],[72,0,72,2],[59,0,59,1],[67,0,67,1],[49,2,49,6],[77,0,77,1],[81,0,81,1],[78,0,78,1],[16,0,16,6],[18,0,18,1],[22,4,22,5],[25,4,25,5],[45,0,45,1],[18,2,18,6],[20,2,20,6],[20,0,20,1],[22,0,22,1],[25,0,25,1],[32,0,32,1],[33,0,33,1],[36,0,36,1],[37,0,37,1],[38,0,38,1],[42,0,42,1],[79,0,79,1],[80,0,80,1],[82,0,82,1],[83,0,83,1],[95,0,95,1],[96,2,96,6],[97,0,97,1],[91,0,91,1],[92,0,92,1],[92,2,92,6],[93,0,93,1],[94,0,94,1],[94,2,94,6],[138,0,141,6],[43,0,43,1],[39,0,39,1],[40,0,40,1],[41,0,41,1],[119,0,119,1],[115,0,115,1],[116,0,116,1],[116,2,116,3],[117,0,117,1],[118,0,118,1],[118,2,118,3],[112,0,112,1],[112,2,112,3],[100,0,100,6],[113,0,113,1],[114,0,114,1],[106,0,106,6],[101,0,101,5],[102,0,102,5],[103,0,103,5],[104,0,104,5],[114,2,114,3],[109,0,109,1]]}
[" "]
[null,null,null,null," "," "]
[]
[]
[]
[null,null,null,null," "," "," "]
[]
[]
[]
[]
[]
[]
[]
[]
[]
[]
["Cotización de Seguro Médico - Bupa Global Health Plans"]
[]
["Nombre del asegurado titular :",null,{"$f":"+'INGRESO DE DATOS'!$D$15","v":"JUAN VIDAL"}]
[]
{"$rows_left_out":120}
{"sheet":"Tablas","index":9,"n_rows":1657,"n_cols":37,"rows_kept":1657,"cut":false,"hidden":true,"merged":[[1583,25,1583,31],[1584,25,1584,31],[1585,25,1585,26],[1585,27,1585,31],[1583,32,1583,37],[1584,32,1584,37],[1585,32,1585,33],[1585,34,1585,37],[1583,0,1583,6],[1584,0,1584,6],[1584,20,1584,23],[1585,0,1585,1],[1585,2,1585,6],[1126,2,1126,6],[752,0,752,1],[752,2,752,6],[825,0,825,6],[826,0,826,6],[827,0,827,1],[827,2,827,6],[900,0,900,6],[901,0,901,6],[902,0,902,1],[902,2,902,6],[975,0,975,6],[976,0,976,1],[1050,0,1050,6],[1051,0,1051,1],[1051,2,1051,6],[1,0,1,6],[2,0,2,6],[77,0,77,1],[77,2,77,6],[76,0,76,6],[3,0,3,1],[3,2,3,6],[976,2,976,6],[1049,0,1049,6],[526,0,526,6],[450,0,450,6],[451,0,451,6],[452,0,452,1],[452,2,452,6],[525,0,525,6],[376,0,376,1],[376,2,376,6],[150,0,150,6],[151,0,151,6],[152,0,152,1],[152,2,152,6],[225,0,225,6],[226,0,226,1],[375,0,375,6],[1508,0,1508,6],[1509,0,1509,1],[1509,2,1509,6],[4,8,4,12],[1424,0,1424,6],[1425,0,1425,6],[1426,0,1426,1],[1426,2,1426,6],[1276,0,1276,1],[1276,2,1276,6],[1349,0,1349,6],[1350,0,1350,6],[1351,0,1351,1],[1351,2,1351,6],[1200,0,1200,6],[1201,0,1201,6],[1202,0,1202,1],[1202,2,1202,6],[1275,0,1275,6],[226,2,226,6],[300,0,300,6],[301,0,301,6],[302,0,302,1],[302,2,302,6],[1438,28,1438,29],[1439,28,1439,29],[1440,28,1440,29],[2,20,2,23],[151,20,151,23],[301,20,301,23],[901,20,901,23],[1201,20,1201,23],[1507,0,1507,6],[751,0,751,6],[675,0,675,6],[676,0,676,6],[677,0,677,1],[677,2,677,6],[750,0,750,6],[527,0,527,1],[527,2,527,6],[600,0,600,6],[601,0,601,6],[602,0,602,1],[602,2,602,6],[1124,0,1124,6],[1125,0,1125,6],[1126,0,1126,1]]}
[null,null,null,null,null,null,null,null,null,null,null,null,null,null,null,null,null,null,null,null,null,null,null,null,null,null,null,"Regiones"]
["BUPA GLOBAL ELITE",null,null,null,null,null,null,null,"FACTOR MENSUAL:",null,{"$f":"IF('INGRESO DE DATOS'!E25,0.09,0.09)","v":0.09},null,"% Anteriores",9.2499999999999999E-2,null,"Usamed",625,null,null,null,null,null,null,null,null,null,null,"Zona 1: Sonora, Baja California Sur, Jalisco, Chihuahua, Coahulia, Tama"]
["TARIFAS ANUALES",null,null,null,null,null,null,null,"FACTOR TRIMESTRAL:",null,{"$f":"IF('INGRESO DE DATOS'!E27,0,0.075)","v":0},null,null,0.26874999999999999]
["EDAD",null,null,null,null,null,null,null,"FACTOR SEMIANUAL:",null,{"$f":"IF('INGRESO DE DATOS'!E25,0,0.045)","v":0},null,null,0.52249999999999996]
[" "," ",1000,2000,3500,5000,10000,null,null,null,null,null,null,null,"Otros dependientes panel"]
[18,null,186475,133037.5,105575,91050,68375,null,null,null,null,null,null,null,"Edad otros dependientes","ID",1000,2000,3500,5000,10000]
[19,null,192750,137512.5,109137.5,94112.5,70675,null,null,null,null,null,null,null,{"$f":"'INGRESO DE DATOS'!$L$16","v":0},1,{"$f":"IF(O7>0,(IF(O7>18,VLOOKUP(O7,$A$6:$G$72,3,FALSE),Tablas!$C$6)),0)","v":0},{"$f":"IF(O7>0,(IF(O7>18,VLOOKUP(O7,$A$6:$G$72,4,FALSE),Tablas!$D$6)),0)","v":0},{"$f":"IF(O7>0,(IF(O7>18,VLOOKUP(O7,$A$6:$G$72,5,FALSE),Tablas!$E$6)),0)","v":0},{"$f":"IF(O7>0,(IF(O7>18,VLOOKUP(O7,$A$6:$G$72,6,FALSE),Tablas!$F$6)),0)","v":0},{"$f":"IF(O7>0,(IF(O7>18,VLOOKUP(O7,$A$6:$G$72,7,FALSE),Tablas!$G$6)),0)","v":0}]
[20,null,199237.5,142137.5,112800,97287.5,73062.5,null,null,null,null,null,null,null,{"$f":"'INGRESO DE DATOS'!$L$17","v":0},2,{"$f":"IF(O8>0,(IF(O8>18,VLOOKUP(O8,$A$6:$G$72,3,FALSE),Tablas!$C$6)),0)","v":0},{"$f":"IF(O8>0,(IF(O8>18,VLOOKUP(O8,$A$6:$G$72,4,FALSE),Tablas!$D$6)),0)","v":0},{"$f":"IF(O8>0,(IF(O8>18,VLOOKUP(O8,$A$6:$G$72,5,FALSE),Tablas!$E$6)),0)","v":0},{"$f":"IF(O8>0,(IF(O8>18,VLOOKUP(O8,$A$6:$G$72,6,FALSE),Tablas!$F$6)),0)","v":0},{"$f":"IF(O8>0,(IF(O8>18,VLOOKUP(O8,$A$6:$G$72,7,FALSE),Tablas!$G$6)),0)","v":0}]
[21,null,205937.5,146925,116600,100562.5,75512.5,null,null,null,null,null,null,null,{"$f":"'INGRESO DE DATOS'!$L$18","v":0},3,{"$f":"IF(O9>0,(IF(O9>18,VLOOKUP(O9,$A$6:$G$72,3,FALSE),Tablas!$C$6)),0)","v":0},{"$f":"IF(O9>0,(IF(O9>18,VLOOKUP(O9,$A$6:$G$72,4,FALSE),Tablas!$D$6)),0)","v":0},{"$f":"IF(O9>0,(IF(O9>18,VLOOKUP(O9,$A$6:$G$72,5,FALSE),Tablas!$E$6)),0)","v":0},{"$f":"IF(O9>0,(IF(O9>18,VLOOKUP(O9,$A$6:$G$72,6,FALSE),Tablas!$F$6)),0)","v":0},{"$f":"IF(O9>0,(IF(O9>18,VLOOKUP(O9,$A$6:$G$72,7,FALSE),Tablas!$G$6)),0)","v":0}]
[22,null,212862.5,151875,120525,103937.5,78062.5,null,null,null,null,null,null,null,{"$f":"'INGRESO DE DATOS'!$L$19","v":0},4,{"$f":"IF(O10>0,(IF(O10>18,VLOOKUP(O10,$A$6:$G$72,3,FALSE),Tablas!$C$6)),0)","v":0},{"$f":"IF(O10>0,(IF(O10>18,VLOOKUP(O10,$A$6:$G$72,4,FALSE),Tablas!$D$6)),0)","v":0},{"$f":"IF(O10>0,(IF(O10>18,VLOOKUP(O10,$A$6:$G$72,5,FALSE),Tablas!$E$6)),0)","v":0},{"$f":"IF(O10>0,(IF(O10>18,VLOOKUP(O10,$A$6:$G$72,6,FALSE),Tablas!$F$6)),0)","v":0},{"$f":"IF(O10>0,(IF(O10>18,VLOOKUP(O10,$A$6:$G$72,7,FALSE),Tablas!$G$6)),0)","v":0}]
[23,null,220025,156975,124575,107437.5,80687.5,null,null,null,null,null,null,null,{"$f":"'INGRESO DE DATOS'!$L$20","v":0},5,{"$f":"IF(O11>0,(IF(O11>18,VLOOKUP(O11,$A$6:$G$72,3,FALSE),Tablas!$C$6)),0)","v":0},{"$f":"IF(O11>0,(IF(O11>18,VLOOKUP(O11,$A$6:$G$72,4,FALSE),Tablas!$D$6)),0)","v":0},{"$f":"IF(O11>0,(IF(O11>18,VLOOKUP(O11,$A$6:$G$72,5,FALSE),Tablas!$E$6)),0)","v":0},{"$f":"IF(O11>0,(IF(O11>18,VLOOKUP(O11,$A$6:$G$72,6,FALSE),Tablas!$F$6)),0)","v":0},{"$f":"IF(O11>0,(IF(O11>18,VLOOKUP(O11,$A$6:$G$72,7,FALSE),Tablas!$G$6)),0)","v":0}]
[24,null,227437.5,162262.5,128775,111050,83400,null,null,null,null,null,null,null,null,"Total",{"$f":"SUM(Q7:Q11)","v":0},{"$f":"SUM(R7:R11)","v":0},{"$f":"SUM(S7:S11)","v":0},0,0]
[25,null,235087.5,167725,133100,114787.5,86200]
[26,null,243000,173362.5,137587.5,118650,89100]
[27,null,251175,179200,142212.5,122650,92100]
[28,null,259625,185225,147000,126775,95200]
[29,null,268362.5,191462.5,151950,131037.5,98412.5]
[30,null,277387.5,197900,157062.5,135450,101712.5]
[31,null,286725,204562.5,162337.5,140000,105137.5]
[32,null,296375,211450,167800,144712.5,108675]
{"$rows_left_out":1637}