{"text_format":"1","workbook":"xlsx","n_sheets":4,"sheets":["INGRESO DE DATOS","Global Premier","Resumen tarifas","Tablas"],"not_rendered":{"charts":0,"images":5,"macros":1,"external_links":0,"defined_names":2,"comments":1,"pivot_tables":0},"unopened":[],"bounds":{"document_bytes":16777216,"sheet_cells":100000,"rows_first":2000,"rows_last":500,"rows_between":2000,"halvings":0,"cell_chars":16384,"cell_head_chars":4096},"cells_cut":0,"cells_raw":0,"read":"whole","date_system":"1900"}

{"sheet":"INGRESO DE DATOS","index":0,"n_rows":26,"n_cols":9,"rows_kept":26,"cut":false,"hidden":false,"merged":[[9,0,9,7],[23,3,23,4],[23,6,23,7],[18,5,18,6],[14,1,14,2],[16,1,16,2],[14,3,14,7],[16,5,16,6],[18,1,18,2]]}
[]
[null,null,null,null,null,null,null," "," "]
[]
[]
[]
[]
[]
[]
[]
["(Para renovaciones de pólizas emitidas en 2020)"]
[]
[]
["LLENE LA INFORMACIÓN DEL ASEGURADO PROPUESTO:"]
[]
[null,"Nombre del Asegurado Titular:",null,"NOMBRE COMPLETO"]
[]
[null,"Número de adultos en la póliza:",null,2,null,"Número de niños en la póliza:",null,2]
[]
[null,"Edad del Asegurado Titular:",null,32,null,"Edad del/la cónyuge :",null,46]
[]
[]
[]
[]
[]
[]
[null,1,null,1]

{"sheet":"Global Premier","index":1,"n_rows":62,"n_cols":10,"rows_kept":62,"cut":false,"hidden":false,"merged":[[60,4,60,9],[59,4,59,9],[61,4,62,9],[46,4,46,5],[43,0,44,0],[15,0,15,1],[52,4,52,5],[53,4,53,5],[28,4,28,9],[37,4,37,9],[48,4,48,9],[16,3,16,4],[18,3,18,4],[20,3,20,4],[16,5,16,8],[43,1,44,1]]}
[]
[]
[]
[null,null,null,null,null,null,null," "," "," "]
[]
[]
[]
[]
[]
[]
[]
[]
[]
[]
[]
["GLOBAL PREMIER HEALTH PLAN"]
[null,null,null,"Nombre del Asegurado Titular:",null,{"$f":"+'INGRESO DE DATOS'!$D$15","v":"NOMBRE COMPLETO"}]
[]
[null,null,null,"Número de adultos en la póliza:",null,{"$f":"+'INGRESO DE DATOS'!$D$17","v":2},null,"Edad del Asegurado Titular:",{"$f":"+'INGRESO DE DATOS'!$D$19","v":32}]
[]
[null,null,null,"Número de niños en la póliza:",null,{"$f":"+'INGRESO DE DATOS'!$H$17","v":2},null,"Edad del/la conyuge:",{"$f":"+'INGRESO DE DATOS'!$H$19","v":46}]
[null,null,null,null,null,null,null," "," "]
[null,null,null,null,null,null,null,"Fecha de la cotización:",{"$f":"NOW()","v":"2022-11-29T15:01:33.290"}]
[null,null,null,null,null,null," ",false,null," "]
[null,null,null,null,"Deducibles",null,"PLAN 1","PLAN 2","PLAN 3","PLAN 4"]
[null,null,null,null,"En el país de residencia",null,250,2000,5000,10000]
[null,null,null,null,"Fuera del país de residencia",null,5000,2000,5000,10000]
[]
[null,null,null,null,"Tarifas anuales"]
[null,null,null,null,"Prima para Asegurado Titular",null,{"$f":"VLOOKUP($I$19,Tablas!$A$155:$G$221,3,TRUE)","v":5565.8},{"$f":"VLOOKUP($I$19,Tablas!$A$155:$G$221,4,TRUE)","v":5051.55},{"$f":"VLOOKUP($I$19,Tablas!$A$155:$G$221,5,TRUE)","v":3643.95},{"$f":"VLOOKUP($I$19,Tablas!$A$155:$G$221,6,TRUE)","v":2638.4}]
[null,null,null,null,"Prima para conyuge",null,{"$f":"IF($F$19=1,0,(VLOOKUP($I$21,Tablas!$A$155:$G$221,3,TRUE)))","v":7633},{"$f":"IF($F$19=1,0,(VLOOKUP($I$21,Tablas!$A$155:$G$221,4,TRUE)))","v":6926.65},{"$f":"IF($F$19=1,0,(VLOOKUP($I$21,Tablas!$A$155:$G$221,5,TRUE)))","v":4888.3499999999995},{"$f":"IF($F$19=1,0,(VLOOKUP($I$21,Tablas!$A$155:$G$221,6,TRUE)))","v":3537.7}]
[null,null,null,null,"Prima para hijo (s)",null,{"$f":"IF($F$21=0,0,(VLOOKUP($F$21,Tablas!$A$222:$G$224,3,TRUE)))","v":3371.1},{"$f":"IF($F$21=0,0,(VLOOKUP($F$21,Tablas!$A$222:$G$224,4,TRUE)))","v":3057.45},{"$f":"IF($F$21=0,0,(VLOOKUP($F$21,Tablas!$A$222:$G$224,5,TRUE)))","v":2288.1999999999998},{"$f":"IF($F$21=0,0,(VLOOKUP($F$21,Tablas!$A$222:$G$224,6,TRUE)))","v":1658.35}]
[null,null,null,null,"Total de Prima neta",null,{"$f":"SUM(G30:G32)","v":16569.899999999998},{"$f":"SUM(H30:H32)","v":15035.650000000001},10820.5,{"$f":"SUM(J30:J32)","v":7834.4500000000007}]
[null,null,null,null,"Tarifa administrativa anual",null,75,75,75,75]
[null,null,null,null,"IVA (12%)",null,{"$f":"(G33+G34)*12%","v":1997.3879999999997},{"$f":"(H33+H34)*12%","v":1813.278},1307.46,{"$f":"(J33+J34)*12%","v":949.13400000000001}]
[null,null,null,null,"TOTAL ANUAL",null,{"$f":"SUM(G33:G35)","v":18642.287999999997},{"$f":"SUM(H33:H35)","v":16923.928},{"$f":"SUM(I33:I35)","v":12202.96},{"$f":"SUM(J33:J35)","v":8858.5840000000007}]
[]
[null,null,null,null,"Tarifas semi anuales"]
[null,null,null,null,"Prima para Asegurado Titular",null,{"$f":"VLOOKUP($I$19,Tablas!$A$530:$G$596,3,TRUE)","v":2949.8740000000003},{"$f":"VLOOKUP($I$19,Tablas!$A$530:$G$596,4,TRUE)","v":2677.3215},{"$f":"VLOOKUP($I$19,Tablas!$A$530:$G$596,5,TRUE)","v":1931.2935},{"$f":"VLOOKUP($I$19,Tablas!$A$530:$G$596,6,TRUE)","v":1398.3520000000001}]
[null,null,null,null,"Prima para conyuge",null,{"$f":"IF($F$19=1,0,(VLOOKUP($I$21,Tablas!$A$530:$G$596,3,TRUE)))","v":4045.4900000000002},{"$f":"IF($F$19=1,0,(VLOOKUP($I$21,Tablas!$A$530:$G$596,4,TRUE)))","v":3671.1244999999999},{"$f":"IF($F$19=1,0,(VLOOKUP($I$21,Tablas!$A$530:$G$596,5,TRUE)))","v":2590.8254999999999},{"$f":"IF($F$19=1,0,(VLOOKUP($I$21,Tablas!$A$530:$G$596,6,TRUE)))","v":1874.981}]
[null,null,null,null,"Prima para hijo (s)",null,{"$f":"IF($F$21=0,0,(VLOOKUP($F$21,Tablas!$A$597:$G$599,3,TRUE)))","v":1786.683},{"$f":"IF($F$21=0,0,(VLOOKUP($F$21,Tablas!$A$597:$G$599,4,TRUE)))","v":1620.4485},{"$f":"IF($F$21=0,0,(VLOOKUP($F$21,Tablas!$A$597:$G$599,5,TRUE)))","v":1212.7459999999999},{"$f":"IF($F$21=0,0,(VLOOKUP($F$21,Tablas!$A$597:$G$599,6,TRUE)))","v":878.92549999999994}]
[null,null,null,null,"Total de Prima neta",null,{"$f":"SUM(G39:G41)","v":8782.0470000000005},{"$f":"SUM(H39:H41)","v":7968.8945000000003},{"$f":"SUM(I39:I41)","v":5734.8649999999998},{"$f":"SUM(J39:J41)","v":4152.2584999999999}]
[null,null,null,null,"Tarifa administrativa anual",null,75,75,75,75]
[null,null,null,null,"IVA (12%)",null,{"$f":"(G42+G43)*12%","v":1062.84564},{"$f":"(H42+H43)*12%","v":965.26733999999999},697.18379999999991,{"$f":"(J42+J43)*12%","v":507.27101999999996}]
[null,null,null,null,"TOTAL de primera cuota",null,{"$f":"SUM(G42:G44)","v":9919.89264},{"$f":"SUM(H42:H44)","v":9009.1618400000007},{"$f":"SUM(I42:I44)","v":6507.0487999999996},{"$f":"SUM(J42:J44)","v":4734.52952}]
[null,null,null,null,"Costo de segunda cuota",null,{"$f":"G42+G44 - G43*12%","v":9835.89264},{"$f":"H42+H44 - H43*12%","v":8925.1618400000007},6423.0487999999996,{"$f":"J42+J44 - J43*12%","v":4650.52952}]
[null,null,null,null,"TOTAL ANUAL",null,{"$f":"G45+G46","v":19755.78528},{"$f":"H45+H46","v":17934.323680000001},12930.097599999999,{"$f":"J45+J46","v":9385.0590400000001}]
[]
[null,null,null,null,"Tarifas trimestrales"]
[null,null,null,null,"Prima para Asegurado Titular",null,{"$f":"VLOOKUP($I$19,Tablas!$A$755:$G$821,3,TRUE)","v":1530.5950000000003},{"$f":"VLOOKUP($I$19,Tablas!$A$755:$G$821,4,TRUE)","v":1389.1762500000002},{"$f":"VLOOKUP($I$19,Tablas!$A$755:$G$821,5,TRUE)","v":1002.0862500000001},{"$f":"VLOOKUP($I$19,Tablas!$A$755:$G$821,6,TRUE)","v":725.56000000000006}]
[null,null,null,null,"Prima para conyuge",null,{"$f":"IF($F$19=1,0,(VLOOKUP($I$21,Tablas!$A$755:$G$821,3,TRUE)))","v":2099.0750000000003},{"$f":"IF($F$19=1,0,(VLOOKUP($I$21,Tablas!$A$755:$G$821,4,TRUE)))","v":1904.8287500000001},{"$f":"IF($F$19=1,0,(VLOOKUP($I$21,Tablas!$A$755:$G$821,5,TRUE)))","v":1344.2962499999999},{"$f":"IF($F$19=1,0,(VLOOKUP($I$21,Tablas!$A$755:$G$821,6,TRUE)))","v":972.86750000000006}]
[null,null,null,null,"Prima para hijo (s)",null,{"$f":"IF($F$21=0,0,(VLOOKUP($F$21,Tablas!$A$822:$G$824,3,TRUE)))","v":927.05250000000001},{"$f":"IF($F$21=0,0,(VLOOKUP($F$21,Tablas!$A$822:$G$824,4,TRUE)))","v":840.79875000000004},{"$f":"IF($F$21=0,0,(VLOOKUP($F$21,Tablas!$A$822:$G$824,5,TRUE)))","v":629.255},{"$f":"IF($F$21=0,0,(VLOOKUP($F$21,Tablas!$A$822:$G$824,6,TRUE)))","v":456.04624999999999}]
[null,null,null,null,"Total de Prima neta",null,{"$f":"SUM(G50:G52)","v":4556.7225000000008},{"$f":"SUM(H50:H52)","v":4134.80375},{"$f":"SUM(I50:I52)","v":2975.6374999999998},{"$f":"SUM(J50:J52)","v":2154.4737500000001}]
[null,null,null,null,"Tarifa administrativa anual",null,75,75,75,75]
[null,null,null,null,"IVA (12%)",null,{"$f":"(G53+G54)*12%","v":555.80670000000009},{"$f":"(H53+H54)*12%","v":505.17644999999999},366.07649999999995,{"$f":"(J53+J54)*12%","v":267.53685000000002}]
[null,null,null,null,"TOTAL de primera cuota",null,{"$f":"SUM(G53:G55)","v":5187.5292000000009},{"$f":"SUM(H53:H55)","v":4714.9802},{"$f":"SUM(I53:I55)","v":3416.7139999999999},{"$f":"SUM(J53:J55)","v":2497.0106000000001}]
[null,null,null,null,"Costo de tarifa trimestral 2 a 4",null,{"$f":"G53+G55 - G54*12%","v":5103.5292000000009},{"$f":"H53+H55 - H54*12%","v":4630.9802},3332.7139999999999,{"$f":"J53+J55 - J54*12%","v":2413.0106000000001}]
[null,null,null,null,"TOTAL ANUAL",null,{"$f":"G56+(G57*3)","v":20498.116800000003},{"$f":"H56+(H57*3)","v":18607.9208},13414.856,{"$f":"J56+(J57*3)","v":9736.0424000000003}]
[]
[]
[null,null,null,null,"Tarifas en US $ -   Efectivas a partir del 1ro de enero de  2023"]
[null,null,null,null,"Este presupuesto solamente tiene carácter informativo y en ningún momento expresa compromiso legal para suministrarle cobertura de seguro. La emisión de una póliza de seguro Bupa está sujeta a todas las evaluaciones de riesgo por parte de Bupa y a la recepción de todos los pagos de prima requeridos."]

{"sheet":"Resumen tarifas","index":2,"n_rows":60,"n_cols":8,"rows_kept":60,"cut":false,"hidden":false,"merged":[[44,4,44,7],[46,4,46,7],[49,4,49,7],[49,0,49,1],[26,0,26,6],[28,2,28,6],[31,4,31,5],[34,4,34,5],[28,0,28,1],[31,0,31,1],[34,0,34,1],[44,0,44,1],[45,0,45,1],[46,0,46,1],[47,0,47,1],[41,0,41,1],[57,0,57,7],[58,0,58,7],[59,0,61,7],[55,0,55,1],[50,0,50,1]]}
[]
[null,null,null,null," "," "]
[]
[]
[]
[]
[]
[]
[]
[null,null,null,null," "," "," "]
[]
[]
[]
[]
[]
[]
[]
[]
[]
[]
[]
[]
[]
[]
[]
[]
["Cotizador de Seguro Médico - Bupa Global Health Plans"]
[]
["Nombre del Asegurado Titular",null,{"$f":"+'INGRESO DE DATOS'!$D$15","v":"NOMBRE COMPLETO"}]
[]
[]
["Número de adultos en la póliza",null,{"$f":"+'INGRESO DE DATOS'!$D$17","v":2},null,"Edad del Asegurado Titular",null,{"$f":"+'INGRESO DE DATOS'!$D$19","v":32}]
[]
[]
["Número de niños en la póliza",null,{"$f":"+'INGRESO DE DATOS'!$H$17","v":2},null,"Edad del/la cónyuge ",null,{"$f":"+'INGRESO DE DATOS'!$H$19","v":46}]
[]
[]
[null,null,null,"FECHA DE LA COTIZACIÓN :",{"$f":"NOW()","v":"2022-11-29T15:01:33.290"}]
[]
[]
["Global Premier Health Plan"]
["Deducibles",null,null,null,"PLAN 1","PLAN 2","PLAN 3","PLAN 3"]
["En el país de residencia",null,null,null,250,2000,5000,10000]
["Fuera del país de residencia",null,null,null,5000,2000,5000,10000]
[null,null,null,null,"Tarifas anuales"]
[null,null,null,null,{"$f":"+'Global Premier'!G36","v":18642.287999999997},{"$f":"+'Global Premier'!H36","v":16923.928},{"$f":"+'Global Premier'!I36","v":12202.96},{"$f":"+'Global Premier'!J36","v":8858.5840000000007}]
[null,null,null,null,"Tarifas semi anuales"]
[null,null,null,null,{"$f":"+'Global Premier'!G45","v":9919.89264},{"$f":"+'Global Premier'!H45","v":9009.1618400000007},{"$f":"+'Global Premier'!I45","v":6507.0487999999996},{"$f":"+'Global Premier'!J45","v":4734.52952}]
[null,null,null,null,{"$f":"+'Global Premier'!G46","v":9835.89264},{"$f":"+'Global Premier'!H46","v":8925.1618400000007},{"$f":"+'Global Premier'!I46","v":6423.0487999999996},{"$f":"+'Global Premier'!J46","v":4650.52952}]
[null,null,null,null,"Tarifas trimestrales"]
[null,null,null,null,{"$f":"+'Global Premier'!G56","v":5187.5292000000009},{"$f":"+'Global Premier'!H56","v":4714.9802},{"$f":"+'Global Premier'!I56","v":3416.7139999999999},{"$f":"+'Global Premier'!J56","v":2497.0106000000001}]
[null,null,null,null,{"$f":"+'Global Premier'!G57","v":5103.5292000000009},{"$f":"+'Global Premier'!H57","v":4630.9802},{"$f":"+'Global Premier'!I57","v":3332.7139999999999},{"$f":"+'Global Premier'!J57","v":2413.0106000000001}]
[]
[]
["Una tarifa administrativa de US$75 se carga automáticamente al primer pago"]
["*Basado en un modo de pago anual"]
[]
[]
["Tarifas en US $ -   Efectivas a partir del 1ro de enero de  2023"]
["Este presupuesto solamente tiene carácter informativo y en ningún momento expresa compromiso legal para suministrarle cobertura de seguro. La emisión de una póliza de seguro Bupa está sujeta a todas las evaluaciones de riesgo por parte de Bupa y a la recepción de todos los pagos de prima requeridos."]

{"sheet":"Tablas","index":3,"n_rows":1497,"n_cols":22,"rows_kept":1497,"cut":false,"hidden":true,"merged":[[752,0,752,1],[752,2,752,6],[825,0,825,6],[826,0,826,6],[827,0,827,1],[827,2,827,6],[751,0,751,6],[675,0,675,6],[676,0,676,6],[677,0,677,1],[677,2,677,6],[750,0,750,6],[527,0,527,1],[527,2,527,6],[600,0,600,6],[601,0,601,6],[602,0,602,1],[602,2,602,6],[526,0,526,6],[450,0,450,6],[451,0,451,6],[452,0,452,1],[452,2,452,6],[525,0,525,6],[376,0,376,1],[376,2,376,6],[150,0,150,6],[151,0,151,6],[152,0,152,1],[152,2,152,6],[225,0,225,6],[226,0,226,1],[375,0,375,6],[226,2,226,6],[300,0,300,6],[301,0,301,6],[302,0,302,1],[302,2,302,6],[1,0,1,6],[2,0,2,6],[77,0,77,1],[77,2,77,6],[76,0,76,6],[3,0,3,1],[3,2,3,6],[900,0,900,6],[901,0,901,6],[902,0,902,1],[902,2,902,6],[975,0,975,6],[976,0,976,1],[976,2,976,6],[1049,0,1049,6],[1050,0,1050,6],[1051,0,1051,1],[1051,2,1051,6],[1124,0,1124,6],[1125,0,1125,6],[1126,0,1126,1],[1126,2,1126,6],[1199,0,1199,6],[1200,0,1200,1],[1200,2,1200,6],[1273,0,1273,6],[1274,0,1274,6],[1275,0,1275,1],[1275,2,1275,6],[1424,0,1424,6],[1425,0,1425,1],[1425,2,1425,6],[1348,0,1348,6],[1349,0,1349,6],[1350,0,1350,1],[1350,2,1350,6],[1423,0,1423,6]]}
[]
["BUPA GLOBAL ELITE",null,null,null,null,null,null,null,"FACTOR MENSUAL:",null,{"$f":"1.12/12","v":9.3333333333333338E-2}]
["TARIFAS ANUALES",null,null,null,null,null,null,null,"FACTOR TRIMESTRAL:",null,{"$f":"1.1/4","v":0.27500000000000002}]
["EDAD",null,null,null,null,null,null,null,"FACTOR SEMIANUAL:",null,{"$f":"1.06/2","v":0.53}]
[" "," ",1000,2000,3500,5000,10000,null,null,null,null,null,1000,2000,3500,5000,10000,1000,2000,3500,5000,10000]
[]
[]
[]
[]
[]
[]
[]
[]
[]
[]
[]
[]
[]
[]
[]
[]
[]
[]
[]
[]
[]
[]
[]
[]
[]
[]
[]
[]
[]
[]
[]
[]
[]
[]
[]
[]
[]
[]
[]
[]
[]
[]
[]
[]
[]
[]
[]
[]
[]
[]
[]
[]
[]
[]
[]
[]
[]
[]
[]
[]
[]
[]
[]
[]
[]
[]
[]
[]
[]
[]
[]
["BUPA GLOBAL ELITE - MENSUALES",null,null,null,null,null,null,"?"]
["EDAD"]
[" "," ",1000,2000,3500]
[18,null,{"$f":"+C6*$K$2","v":0},{"$f":"+D6*$K$2","v":0},0,0,0]
[19,null,{"$f":"+C7*$K$2","v":0},0,0,0,0]
[20,null,{"$f":"+C8*$K$2","v":0},0,0,0,0]
[21,null,{"$f":"+C9*$K$2","v":0},0,0,0,0]
[22,null,{"$f":"+C10*$K$2","v":0},0,0,0,0]
[23,null,{"$f":"+C11*$K$2","v":0},0,0,0,0]
[24,null,{"$f":"+C12*$K$2","v":0},0,0,0,0]
[25,null,{"$f":"+C13*$K$2","v":0},0,0,0,0]
[26,null,{"$f":"+C14*$K$2","v":0},0,0,0,0]
[27,null,{"$f":"+C15*$K$2","v":0},0,0,0,0]
[28,null,{"$f":"+C16*$K$2","v":0},0,0,0,0]
[29,null,{"$f":"+C17*$K$2","v":0},0,0,0,0]
[30,null,{"$f":"+C18*$K$2","v":0},0,0,0,0]
[31,null,{"$f":"+C19*$K$2","v":0},0,0,0,0]
[32,null,{"$f":"+C20*$K$2","v":0},0,0,0,0]
[33,null,{"$f":"+C21*$K$2","v":0},0,0,0,0]
[34,null,{"$f":"+C22*$K$2","v":0},0,0,0,0]
[35,null,{"$f":"+C23*$K$2","v":0},0,0,0,0]
[36,null,{"$f":"+C24*$K$2","v":0},0,0,0,0]
[37,null,{"$f":"+C25*$K$2","v":0},0,0,0,0]
[38,null,{"$f":"+C26*$K$2","v":0},0,0,0,0]
[39,null,{"$f":"+C27*$K$2","v":0},0,0,0,0]
[40,null,{"$f":"+C28*$K$2","v":0},0,0,0,0]
[41,null,{"$f":"+C29*$K$2","v":0},0,0,0,0]
[42,null,{"$f":"+C30*$K$2","v":0},0,0,0,0]
[43,null,{"$f":"+C31*$K$2","v":0},0,0,0,0]
[44,null,{"$f":"+C32*$K$2","v":0},0,0,0,0]
[45,null,{"$f":"+C33*$K$2","v":0},0,0,0,0]
[46,null,{"$f":"+C34*$K$2","v":0},0,0,0,0]
[47,null,{"$f":"+C35*$K$2","v":0},0,0,0,0]
[48,null,{"$f":"+C36*$K$2","v":0},0,0,0,0]
[49,null,{"$f":"+C37*$K$2","v":0},0,0,0,0]
[50,null,{"$f":"+C38*$K$2","v":0},0,0,0,0]
[51,null,{"$f":"+C39*$K$2","v":0},0,0,0,0]
[52,null,{"$f":"+C40*$K$2","v":0},0,0,0,0]
[53,null,{"$f":"+C41*$K$2","v":0},0,0,0,0]
[54,null,{"$f":"+C42*$K$2","v":0},0,0,0,0]
[55,null,{"$f":"+C43*$K$2","v":0},0,0,0,0]
[56,null,{"$f":"+C44*$K$2","v":0},0,0,0,0]
[57,null,{"$f":"+C45*$K$2","v":0},0,0,0,0]
[58,null,{"$f":"+C46*$K$2","v":0},0,0,0,0]
[59,null,{"$f":"+C47*$K$2","v":0},0,0,0,0]
[60,null,{"$f":"+C48*$K$2","v":0},0,0,0,0]
[61,null,{"$f":"+C49*$K$2","v":0},0,0,0,0]
[62,null,{"$f":"+C50*$K$2","v":0},0,0,0,0]
[63,null,{"$f":"+C51*$K$2","v":0},0,0,0,0]
[64,null,{"$f":"+C52*$K$2","v":0},0,0,0,0]
[65,null,{"$f":"+C53*$K$2","v":0},0,0,0,0]
[66,null,{"$f":"+C54*$K$2","v":0},0,0,0,0]
[67,null,{"$f":"+C55*$K$2","v":0},0,0,0,0]
[68,null,{"$f":"+C56*$K$2","v":0},0,0,0,0]
[69,null,{"$f":"+C57*$K$2","v":0},0,0,0,0]
[70,null,{"$f":"+C58*$K$2","v":0},0,0,0,0]
[71,null,{"$f":"+C59*$K$2","v":0},0,0,0,0]
[72,null,{"$f":"+C60*$K$2","v":0},0,0,0,0]
[73,null,{"$f":"+C61*$K$2","v":0},0,0,0,0]
[74,null,{"$f":"+C62*$K$2","v":0},0,0,0,0]
[75,null,{"$f":"+C63*$K$2","v":0},0,0,0,0]
[76,null,{"$f":"+C64*$K$2","v":0},0,0,0,0]
[77,null,{"$f":"+C65*$K$2","v":0},0,0,0,0]
[78,null,{"$f":"+C66*$K$2","v":0},0,0,0,0]
[79,null,{"$f":"+C67*$K$2","v":0},0,0,0,0]
[80,null,{"$f":"+C68*$K$2","v":0},0,0]
[81,null,{"$f":"+C69*$K$2","v":0},0,0]
[82,null,{"$f":"+C70*$K$2","v":0},0,0]
[83,null,{"$f":"+C71*$K$2","v":0},0,0]
[84,"o más",{"$f":"+C72*$K$2","v":0},0,0,0,0]
[1,"Hijo",{"$f":"+C73*$K$2","v":0},0,0,0,0]
[2,"Hijos",{"$f":"+C74*$K$2","v":0},0,0,0,0]
[3,"Hijos o más",{"$f":"+C75*$K$2","v":0},0,0,0,0]
[]
["BUPA GLOBAL PREMIER"]
["TARIFAS ANUALES"]
["EDAD"]
[" "," ",2000,3500,5000,10000,null,null,null,null,null,null,2000,3500,5000,10000]
[18,null,{"$f":"R155","v":4403.8499999999995},{"$f":"S155","v":3998.4},2991.15,2164.1,{"$f":"Q155*$K$6","v":0},null,null,null,null,null,5181,4704,3519,2546,null,{"$f":"M155*0.85","v":4403.8499999999995},{"$f":"N155*0.85","v":3998.4},2991.15,2164.1]
[19,null,{"$f":"R156","v":4459.95},{"$f":"S156","v":4047.7},{"$f":"T156","v":3018.35},{"$f":"U156","v":2184.5},{"$f":"Q156*$K$6","v":0},null,null,null,null,null,5247,4762,3551,2570,null,{"$f":"M156*0.85","v":4459.95},{"$f":"N156*0.85","v":4047.7},{"$f":"O156*0.85","v":3018.35},{"$f":"P156*0.85","v":2184.5}]
[20,null,4514.3499999999995,4096.1499999999996,3049.7999999999997,2207.4499999999998,0,null,null,null,null,null,5311,4819,3588,2597,null,4514.3499999999995,4096.1499999999996,3049.7999999999997,2207.4499999999998]
[21,null,4572.1499999999996,4147.1499999999996,3081.25,2230.4,0,null,null,null,null,null,5379,4879,3625,2624,null,4572.1499999999996,4147.1499999999996,3081.25,2230.4]
[22,null,4629.0999999999995,4204.0999999999995,3112.7,2254.1999999999998,0,null,null,null,null,null,5446,4946,3662,2652,null,4629.0999999999995,4204.0999999999995,3112.7,2254.1999999999998]
[23,null,4691.1499999999996,4258.5,3145.85,2278,0,null,null,null,null,null,5519,5010,3701,2680,null,4691.1499999999996,4258.5,3145.85,2278]
[24,null,4755.75,4316.3,3180.7,2302.65,0,null,null,null,null,null,5595,5078,3742,2709,null,4755.75,4316.3,3180.7,2302.65]
[25,null,4821.2,4374.0999999999995,3216.4,2328.15,0,null,null,null,null,null,5672,5146,3784,2739,null,4821.2,4374.0999999999995,3216.4,2328.15]
[26,null,4915.55,4462.5,3271.65,2367.25,0,null,null,null,null,null,5783,5250,3849,2785,null,4915.55,4462.5,3271.65,2367.25]
[27,null,5012.45,4551.75,3326.9,2408.0499999999997,0,null,null,null,null,null,5897,5355,3914,2833,null,5012.45,4551.75,3326.9,2408.0499999999997]
[28,null,5115.3,4642.7,3383.85,2449.6999999999998,0,null,null,null,null,null,6018,5462,3981,2882,null,5115.3,4642.7,3383.85,2449.6999999999998]
[29,null,5223.25,4739.5999999999995,3445.0499999999997,2494.75,0,null,null,null,null,null,6145,5576,4053,2935,null,5223.25,4739.5999999999995,3445.0499999999997,2494.75]
[30,null,5333.75,4842.45,3509.65,2541.5,0,null,null,null,null,null,6275,5697,4129,2990,null,5333.75,4842.45,3509.65,2541.5]
[31,null,5446.8,4944.45,3576.7999999999997,2589.1,0,null,null,null,null,null,6408,5817,4208,3046,null,5446.8,4944.45,3576.7999999999997,2589.1]
[32,null,5565.8,5051.55,3643.95,2638.4,0,null,null,null,null,null,6548,5943,4287,3104,null,5565.8,5051.55,3643.95,2638.4]
[33,null,5687.3499999999995,5162.8999999999996,3717.9,2690.25,0,null,null,null,null,null,6691,6074,4374,3165,null,5687.3499999999995,5162.8999999999996,3717.9,2690.25]
[34,null,5814,5275.95,3790.15,2743.7999999999997,0,null,null,null,null,null,6840,6207,4459,3228,null,5814,5275.95,3790.15,2743.7999999999997]
[35,null,5943.2,5395.8,3869.2,2801.6,0,null,null,null,null,null,6992,6348,4552,3296,null,5943.2,5395.8,3869.2,2801.6]
[36,null,6078.3499999999995,5516.5,3949.95,2858.5499999999997,0,null,null,null,null,null,7151,6490,4647,3363,null,6078.3499999999995,5516.5,3949.95,2858.5499999999997]
[37,null,6216.05,5640.5999999999995,4031.5499999999997,2918.0499999999997,0,null,null,null,null,null,7313,6636,4743,3433,null,6216.05,5640.5999999999995,4031.5499999999997,2918.0499999999997]
[38,null,6357.15,5771.5,4116.55,2979.25,0,null,null,null,null,null,7479,6790,4843,3505,null,6357.15,5771.5,4116.55,2979.25]
[39,null,6504.2,5904.0999999999995,4203.25,3043,0,null,null,null,null,null,7652,6946,4945,3580,null,6504.2,5904.0999999999995,4203.25,3043]
[40,null,6652.95,6039.25,4291.6499999999996,3105.9,0,null,null,null,null,null,7827,7105,5049,3654,null,6652.95,6039.25,4291.6499999999996,3105.9]
[41,null,6807.65,6177.8,4383.45,3173.0499999999997,0,null,null,null,null,null,8009,7268,5157,3733,null,6807.65,6177.8,4383.45,3173.0499999999997]
[42,null,6962.3499999999995,6318.9,4480.3499999999995,3241.9,0,null,null,null,null,null,8191,7434,5271,3814,null,6962.3499999999995,6318.9,4480.3499999999995,3241.9]
[43,null,7126.4,6465.95,4578.0999999999995,3315.85,0,null,null,null,null,null,8384,7607,5386,3901,null,7126.4,6465.95,4578.0999999999995,3315.85]
[44,null,7287.9,6615.55,4679.25,3388.1,0,null,null,null,null,null,8574,7783,5505,3986,null,7287.9,6615.55,4679.25,3388.1]
[45,null,7458.75,6771.0999999999995,4782.95,3462.9,0,null,null,null,null,null,8775,7966,5627,4074,null,7458.75,6771.0999999999995,4782.95,3462.9]
[46,null,7633,6926.65,4888.3499999999995,3537.7,0,null,null,null,null,null,8980,8149,5751,4162,null,7633,6926.65,4888.3499999999995,3537.7]
[47,null,7809.8,7086.45,4998,3618.45,0,null,null,null,null,null,9188,8337,5880,4257,null,7809.8,7086.45,4998,3618.45]
[48,null,7990,7250.5,5108.5,3697.5,0,null,null,null,null,null,9400,8530,6010,4350,null,7990,7250.5,5108.5,3697.5]
[49,null,8175.3,7417.95,5221.55,3779.1,0,null,null,null,null,null,9618,8727,6143,4446,null,8175.3,7417.95,5221.55,3779.1]
[50,null,8361.4499999999989,7589.65,5338,3863.25,0,null,null,null,null,null,9837,8929,6280,4545,null,8361.4499999999989,7589.65,5338,3863.25]
[51,null,8554.4,7763.9,5454.45,3949.1,0,null,null,null,null,null,10064,9134,6417,4646,null,8554.4,7763.9,5454.45,3949.1]
[52,null,8752.4499999999989,7941.55,5576.8499999999995,4037.5,0,null,null,null,null,null,10297,9343,6561,4750,null,8752.4499999999989,7941.55,5576.8499999999995,4037.5]
[53,null,8951.35,8124.3,5701.8,4127.5999999999995,0,null,null,null,null,null,10531,9558,6708,4856,null,8951.35,8124.3,5701.8,4127.5999999999995]
[54,null,9155.35,8307.0499999999993,5827.5999999999995,4217.7,0,null,null,null,null,null,10771,9773,6856,4962,null,9155.35,8307.0499999999993,5827.5999999999995,4217.7]
[55,null,9366.15,8499.15,5955.95,4312.05,0,null,null,null,null,null,11019,9999,7007,5073,null,9366.15,8499.15,5955.95,4312.05]
[56,null,9575.25,8691.25,6088.55,4407.25,0,null,null,null,null,null,11265,10225,7163,5185,null,9575.25,8691.25,6088.55,4407.25]
[57,null,9792.85,8886.75,6223.7,4505.8499999999995,0,null,null,null,null,null,11521,10455,7322,5301,null,9792.85,8886.75,6223.7,4505.8499999999995]
[58,null,10013,9085.65,6360.55,4605.3,0,null,null,null,null,null,11780,10689,7483,5418,null,10013,9085.65,6360.55,4605.3]
[59,null,10235.699999999999,9289.65,6500.8,4703.8999999999996,0,null,null,null,null,null,12042,10929,7648,5534,null,10235.699999999999,9289.65,6500.8,4703.8999999999996]
[60,null,10465.199999999999,9497.0499999999993,6643.5999999999995,4809.3,0,null,null,null,null,null,12312,11173,7816,5658,null,10465.199999999999,9497.0499999999993,6643.5999999999995,4809.3]
[61,null,11660.3,10582.5,7393.3,5351.5999999999995,0,null,null,null,null,null,13718,12450,8698,6296,null,11660.3,10582.5,7393.3,5351.5999999999995]
[62,null,12954,11755.5,8211,5943.2,0,null,null,null,null,null,15240,13830,9660,6992,null,12954,11755.5,8211,5943.2]
[63,null,14347.15,13019.449999999999,9092.4499999999989,6582.4,0,null,null,null,null,null,16879,15317,10697,7744,null,14347.15,13019.449999999999,9092.4499999999989,6582.4]
{"$rows_left_out":1297}