{"text_format":"1","workbook":"xlsx","n_sheets":8,"sheets":["INGRESO DE DATOS","Complete","Secure","Premium","Bupa Essential Care","Classic Care","Resumen tarifas anuales","Tablas"],"not_rendered":{"charts":0,"images":8,"macros":1,"external_links":0,"defined_names":5,"comments":1,"pivot_tables":0},"unopened":[],"bounds":{"document_bytes":16777216,"sheet_cells":100000,"rows_first":2000,"rows_last":500,"rows_between":2000,"halvings":0,"cell_chars":16384,"cell_head_chars":4096},"cells_cut":0,"cells_raw":0,"read":"whole","date_system":"1900"}

{"sheet":"INGRESO DE DATOS","index":0,"n_rows":27,"n_cols":12,"rows_kept":27,"cut":false,"hidden":false,"merged":[[22,3,22,9],[6,1,6,8],[15,7,15,8],[11,3,11,9],[13,3,13,5],[13,7,13,8]]}
[]
[]
[]
[]
[" "]
[]
[null,"COTIZACIÓN DE SEGURO MÉDICO INTERNACIONAL"]
[null,null,null,null,null,null,null,null,null,null," "]
[]
["INGRESE LOS DATOS DEL PROPUESTO ASEGURADO:"]
[]
[null,null,"Nombre del Asegurado Principal:","Nombre"]
[null,null,null,null,null,null,null,null,null,null," "," "]
[null,null,null,"Número de Adultos:",null,null,2,"Número de Hijos:",null,2]
[]
[null,null,null,null,null," Edad de Titular:",32,"Edad de Cónyuge:",null,46]
[]
[null,null,null,null,null,"Descuento:",0]
[]
[]
["INGRESE EL NOMBRE DE LA AGENCIA ASESORA:"]
[]
[null,null,"Intermediario:","Agente / Agencia"]
[]
[]
[]
["ESCOJA EL PRODUCTO PARA VISUALIZAR LA COTIZACION RESPECTIVA:"]

{"sheet":"Complete","index":1,"n_rows":65,"n_cols":10,"rows_kept":65,"cut":false,"hidden":false,"merged":[[7,3,7,9],[8,3,8,9],[9,0,9,1],[40,0,40,1],[35,0,35,1],[30,0,30,1],[28,3,28,9],[39,3,39,9],[11,4,11,9],[13,4,13,9],[15,0,15,1],[21,0,21,1],[23,3,23,9],[64,3,66,9],[51,3,51,9],[72,0,72,1],[73,0,73,1],[71,0,71,1],[63,3,63,9],[55,0,55,1]]}
[]
[]
[]
[]
[]
[]
[]
[null,null,null,"Cotización de Seguro Médico Internacional"]
[null,null,null,"Producto: Bupa Complete Care"]
["BUPA COMPLETE CARE"]
[]
[null,null,null,"Nombre del Asegurado:",{"$f":"+'INGRESO DE DATOS'!$D$12","v":"Nombre"}]
[]
[null,null,null,"Intermediario:",{"$f":"+'INGRESO DE DATOS'!$D$23","v":"Agente / Agencia"}]
[]
[null,null,null,"Fecha:",{"$f":"+TODAY()","v":"2022-12-20"},null,{"$f":"IF('INGRESO DE DATOS'!G18>0,\"Descuento\",\"\")","v":""},{"$f":"IF('INGRESO DE DATOS'!G18>0,'INGRESO DE DATOS'!G18,\"\")","v":""}]
[]
[null,null,null,null,null,"Numero de Adultos:",{"$f":"+'INGRESO DE DATOS'!G14","v":2},null,"Edad de Titular:",{"$f":"+'INGRESO DE DATOS'!$G$16","v":32}]
[]
[null,null,null,null,null,"Numero de Hijos:",{"$f":"+'INGRESO DE DATOS'!$J$14","v":2},null,"Edad de Conyuge:",{"$f":"+'INGRESO DE DATOS'!$J$16","v":46}]
[null,null,null,null,null,null," "," "," "]
[null,null,null,null,null,null,null,"Complicaciones de Maternidad (+ $500,000)"]
[null,null,null,null,null,null,null,false]
[null,null,null,"Deducibles"]
[null,null,null,null,"PLAN 1","PLAN 2","PLAN 3","PLAN 4","PLAN 5","PLAN 6"]
[null,null,null,"Dentro del pais de residencia","n/a",1000,2000,5000,10000,20000]
[null,null,null,"Fuera del pais de residencia","n/a",2000,3000,5000,10000,20000]
[]
[null,null,null,"Tarifas Anuales"]
[null,null,null,"Prima Titular","n/a",{"$f":"VLOOKUP($J$18,Tablas!$A$6:$H$29,4,TRUE)","v":13182},{"$f":"VLOOKUP($J$18,Tablas!$A$6:$H$29,5,TRUE)","v":9802},{"$f":"VLOOKUP($J$18,Tablas!$A$6:$H$29,6,TRUE)","v":7149},{"$f":"VLOOKUP($J$18,Tablas!$A$6:$H$29,7,TRUE)","v":5322},{"$f":"VLOOKUP($J$18,Tablas!$A$6:$H$29,8,TRUE)","v":4071}]
{"$rows_left_out":36}
{"sheet":"Secure","index":2,"n_rows":70,"n_cols":12,"rows_kept":70,"cut":false,"hidden":false,"merged":[[7,3,7,9],[8,3,8,9],[19,0,19,1],[9,3,9,8],[9,0,9,1],[11,4,11,9],[13,4,13,9],[13,0,13,1],[69,3,71,9],[72,0,72,1],[68,3,68,9],[25,3,25,9],[30,3,30,9],[42,3,42,9],[33,0,33,1],[25,0,25,1],[38,0,38,1],[43,0,43,1],[54,0,54,1],[55,3,55,9],[70,0,70,1],[71,0,71,1]]}
[]
[]
[]
[]
[]
[]
[]
[null,null,null,"Cotización de Seguro Médico Internacional"]
[null,null,null,"Producto: Bupa Secure Care "]
["BUPA SECURE CARE",null,null,null,null,null,null,null,null,null," "]
[null,null,null,null,null,null,null,null,null,null," "," "]
[null,null,null,"Nombre del Asegurado:",{"$f":"+'INGRESO DE DATOS'!$D$12","v":"Nombre"}]
[]
[null,null,null,"Intermediario:",{"$f":"+'INGRESO DE DATOS'!$D$23","v":"Agente / Agencia"}]
[]
[null,null,null,"Fecha:",{"$f":"+TODAY()","v":"2022-12-20"},null,{"$f":"IF('INGRESO DE DATOS'!G18>0,\"Descuento\",\"\")","v":""},{"$f":"IF('INGRESO DE DATOS'!G18>0,'INGRESO DE DATOS'!G18,\"\")","v":""}]
[]
[null,null,null,null,null,"Numero de Adultos:",{"$f":"+'INGRESO DE DATOS'!$G$14","v":2},null,"Edad de Titular:",{"$f":"+'INGRESO DE DATOS'!$G$16","v":32}]
[]
[null,null,null,null,null,"Numero de Hijos:",{"$f":"+'INGRESO DE DATOS'!$J$14","v":2},null,"Edad de Conyuge:",{"$f":"+'INGRESO DE DATOS'!$J$16","v":46}]
[null,null,null,null,null,null," "," "," "]
[null,null,null,null,null,true,null,"Complicaciones de Maternidad (+ $500,000)"]
[]
[null,null,null,null,null,true,false,"Trasplante de Órganos (+ $500,000)"]
[]
[null,null,null,"Deducibles"]
[null,null,null,null,"PLAN 1","PLAN 2","PLAN 3","PLAN 4","PLAN 5","PLAN 6"]
[null,null,null,"Dentro del pais de residencia","n/a",1000,2000,5000,10000,20000]
[null,null,null,"Fuera del pais de residencia","n/a",2000,3000,5000,10000,20000]
[]
{"$rows_left_out":41}
{"sheet":"Premium","index":3,"n_rows":75,"n_cols":11,"rows_kept":75,"cut":false,"hidden":false,"merged":[[27,3,27,9],[11,0,11,1],[17,0,17,1],[23,0,23,1],[74,3,76,9],[59,3,59,9],[73,0,73,1],[74,0,74,1],[75,0,75,1],[32,0,32,1],[32,3,32,9],[45,3,45,9],[73,3,73,9],[57,0,57,1],[38,0,38,1],[43,0,43,1],[9,0,9,1],[11,4,11,9],[13,4,13,9],[7,3,7,9],[8,3,8,9]]}
[]
[]
[]
[]
[]
[]
[]
[null,null,null,"Cotización de Seguro Médico Internacional"]
[null,null,null,"Producto: Bupa Premium Care"]
["BUPA PREMIUM CARE"]
[null,null,null,null,null,null,null," "," "," "," "]
[null,null,null,"Nombre del Asegurado:",{"$f":"+'INGRESO DE DATOS'!$D$12","v":"Nombre"}]
[]
[null,null,null,"Intermediario:",{"$f":"+'INGRESO DE DATOS'!$D$23","v":"Agente / Agencia"}]
[]
[null,null,null,"Fecha:",{"$f":"+TODAY()","v":"2022-12-20"},null,{"$f":"IF('INGRESO DE DATOS'!G18>0,\"Descuento\",\"\")","v":""},{"$f":"IF('INGRESO DE DATOS'!G18>0,'INGRESO DE DATOS'!G18,\"\")","v":""}]
[]
[null,null,null,null,null,"Numero de Adultos:",{"$f":"+'INGRESO DE DATOS'!$G$14","v":2},null,"Edad de Titular:",{"$f":"+'INGRESO DE DATOS'!$G$16","v":32}]
[]
[null,null,null,null,null,"Numero de Hijos:",{"$f":"+'INGRESO DE DATOS'!$J$14","v":2},null,"Edad de Conyuge:",{"$f":"+'INGRESO DE DATOS'!$J$16","v":46}]
[null,null,null,null,null,null," "," "," "]
[null,null,null,null,null,null,null,"Complicaciones de Maternidad (+ $500,000)"]
[null,null,null,null,null,true]
[null,null,null,null,null,true,null,"Trasplante de Órganos (+ $500,000)"]
[null,null,null,null,null,true]
[null,null,null," ",null,null,null,"Eliminación de Deducible"]
[]
[null,null,null,"Deducibles"]
[null,null,null,null,"PLAN 1","PLAN 2","PLAN 3","PLAN 4","PLAN 5","PLAN 6"]
[null,null,null,"Dentro del pais de residencia","n/a",1000,2000,5000,10000,20000]
{"$rows_left_out":46}
{"sheet":"Bupa Essential Care","index":4,"n_rows":83,"n_cols":11,"rows_kept":83,"cut":false,"hidden":false,"merged":[[82,3,82,9],[41,0,41,1],[43,3,43,9],[55,0,55,1],[59,3,59,9],[69,0,69,1],[70,0,70,1],[71,0,71,1],[75,3,75,9],[76,3,78,9],[80,3,80,9],[81,3,81,9],[36,0,36,1],[7,3,7,9],[8,3,8,9],[9,0,9,1],[10,0,10,1],[10,4,10,9],[12,4,12,9],[16,0,16,1],[22,0,22,1],[25,3,25,9],[30,0,30,1],[30,3,30,9]]}
[]
[]
[]
[]
[]
[]
[]
[null,null,null,"Cotización de Seguro Médico Internacional"]
[null,null,null,"BUPA Essential Care"]
["Bupa Essential Care",null,null,null,null,null,null," "," "," "," "]
[null,null,null,"Nombre del Asegurado:",{"$f":"+'INGRESO DE DATOS'!$D$14","v":"Número de Adultos:"}]
[]
[null,null,null,"Intermediario:",{"$f":"+'INGRESO DE DATOS'!$D$23","v":"Agente / Agencia"}]
[]
[null,null,null,"Fecha:",{"$f":"+TODAY()","v":"2022-12-20"},null,{"$f":"IF('INGRESO DE DATOS'!G20>0,\"Descuento\",\"\")","v":""},{"$f":"IF('INGRESO DE DATOS'!G20>0,'INGRESO DE DATOS'!G20,\"\")","v":""}]
[]
[null,null,null,null,null,"Numero de Adultos:",{"$f":"+'INGRESO DE DATOS'!$G$14","v":2},null,"Edad de Titular:",{"$f":"+'INGRESO DE DATOS'!$G$16","v":32}]
[]
[null,null,null,null,null,"Numero de Hijos:",{"$f":"+'INGRESO DE DATOS'!$J$14","v":2},null,"Edad de Conyuge:",{"$f":"+'INGRESO DE DATOS'!$J$16","v":46}]
[null,null,null,null,null,null," "," "," "]
[null,null,null,null,null,null,null,"Complicaciones de Maternidad (planes 1, 2, y 3)"]
[null,null,null,null,null,true]
[null,null,null,null,null,true,null,"Trasplante de Órganos"]
[null,null,null,null,null,false]
[null,null,null," ",null,null,null,"Eliminación de Deducible"]
[null,null,null,"Deducibles"]
[null,null,null,null,"PLAN 1","PLAN 2","PLAN 3","PLAN 4","PLAN 5","PLAN 6"]
[null,null,null,"Dentro del pais de residencia",250,250,1000,5000,10000,20000]
[null,null,null,"Fuera del pais de residencia",1000,5000,10000,5000,10000,20000]
[]
{"$rows_left_out":54}
{"sheet":"Classic Care","index":5,"n_rows":75,"n_cols":10,"rows_kept":75,"cut":false,"hidden":false,"merged":[[7,0,7,1],[73,3,73,9],[11,4,11,9],[13,4,13,9],[56,0,56,1],[27,3,27,9],[32,3,32,9],[45,3,45,9],[12,0,12,1],[43,0,43,1],[38,0,38,1],[24,0,24,1],[7,3,7,9],[8,3,8,9],[9,0,9,1],[32,0,32,1],[18,0,18,1],[74,3,76,9],[59,3,59,9],[69,0,69,1],[70,0,70,1],[71,0,71,1]]}
[]
[]
[]
[]
[]
[]
[]
[null,null,null,"Cotización de Seguro Médico Internacional"]
[null,null,null,"Bupa Classic Care"]
["BUPA CLASSIC CARE"]
[]
[null,null,null,"Nombre del Asegurado:",{"$f":"+'INGRESO DE DATOS'!$D$12","v":"Nombre"}]
[]
[null,null,null,"Intermediario:",{"$f":"+'INGRESO DE DATOS'!$D$23","v":"Agente / Agencia"}]
[]
[null,null,null,"Fecha:",{"$f":"+TODAY()","v":"2022-12-20"},null,{"$f":"IF('INGRESO DE DATOS'!G18>0,\"Descuento\",\"\")","v":""},{"$f":"IF('INGRESO DE DATOS'!G18>0,'INGRESO DE DATOS'!G18,\"\")","v":""}]
[]
[null,null,null,null,null,"Numero de Adultos:",{"$f":"+'INGRESO DE DATOS'!$G$14","v":2},null,"Edad de Titular:",{"$f":"+'INGRESO DE DATOS'!$G$16","v":32}]
[]
[null,null,null,null,null,"Numero de Hijos:",{"$f":"+'INGRESO DE DATOS'!$J$14","v":2},null,"Edad de Conyuge:",{"$f":"+'INGRESO DE DATOS'!$J$16","v":46}]
[null,null,null,null,null,null," "," "," "]
[null,null,null,null,null,null,null,"Complicaciones de Maternidad (+ $500,000)"]
[null,null,null,null,null,false]
[null,null,null,null,null,false,null,"Trasplante de Órganos (+ $500,000)"]
[null,null,null,null,null,false]
[null,null,null,null,null,null,null,"Eliminación de Deducible"]
[]
[null,null,null,"Deducibles"]
[null,null,null,null,"PLAN 1","PLAN 2","PLAN 3","PLAN 4","PLAN 5","PLAN 6"]
[null,null,null,"Dentro del pais de residencia","n/a",1000,2000,5000,10000,20000]
{"$rows_left_out":46}
{"sheet":"Resumen tarifas anuales","index":6,"n_rows":126,"n_cols":9,"rows_kept":126,"cut":false,"hidden":false,"merged":[[115,2,116,2],[123,2,123,8],[124,2,124,8],[125,2,125,8],[86,2,86,8],[119,2,119,8],[90,2,90,8],[91,2,92,2],[94,2,94,8],[99,2,99,8],[100,2,100,8],[106,2,106,8],[107,2,107,3],[110,2,110,8],[111,2,112,2],[114,2,114,8],[0,0,0,8],[120,2,121,8],[95,2,96,2],[6,3,6,8],[8,3,8,8],[14,1,14,2],[13,1,13,2],[80,2,80,8],[79,2,79,8],[19,2,19,8],[20,2,20,8],[26,2,26,8],[27,2,27,3],[30,2,30,8],[31,2,32,2],[34,2,34,8],[35,2,36,2],[39,2,39,8],[40,2,40,8],[46,2,46,8],[47,2,47,3],[50,2,50,8],[51,2,52,2],[54,2,54,8],[55,2,56,2],[59,2,59,8],[74,2,74,8],[75,2,76,2],[60,2,60,8],[66,2,66,8],[67,2,67,3],[70,2,70,8],[71,2,72,2]]}
["Cotización de Seguro Médico Internacional - BUPA Guatemala"]
[null,null,null,null,null," "," "," "]
[]
[]
[null,null,null,null,null," "," "," "," "]
[]
[null,null,"Nombre del Asegurado:",{"$f":"+'INGRESO DE DATOS'!$D$12","v":"Nombre"}]
[]
[null,null,"Intermediario:",{"$f":"+'INGRESO DE DATOS'!$D$23","v":"Agente / Agencia"}]
[]
[null,null,"Fecha:",{"$f":"+TODAY()","v":"2022-12-20"},null,{"$f":"IF('INGRESO DE DATOS'!G18>0,\"Descuento\",\"\")","v":""},{"$f":"IF('INGRESO DE DATOS'!G18>0,'INGRESO DE DATOS'!G18,\"\")","v":""}]
[]
[null,null,null,null,"Numero de Adultos:",{"$f":"+'INGRESO DE DATOS'!$G$14","v":2},null,"Edad de Titular:",{"$f":"+'INGRESO DE DATOS'!$G$16","v":32}]
[]
[null,null,null,null,"Numero de Hijos:",{"$f":"+'INGRESO DE DATOS'!$J$14","v":2},null,"Edad de Conyuge:",{"$f":"+'INGRESO DE DATOS'!$J$16","v":46}]
[null,null,null,null,null," "," "," "]
[]
[]
[]
[null,null,"COMPLETE CARE"]
[null,null,"Deducibles"]
[null,null,null,"PLAN 1","PLAN 2","PLAN 3","PLAN 4","PLAN 5","PLAN 6"]
[null,null,"Dentro del pais de residencia","n/a",1000,2000,5000,10000,20000]
[null,null,"Fuera del pais de residencia","n/a",2000,3000,5000,10000,20000]
[]
[]
[null,null,"Tarifas Anuales"]
[null,null,"Complete Care",null,{"$f":"+Complete!F38","v":43729.279999999999},{"$f":"+Complete!G38","v":31547.040000000001},{"$f":"+Complete!H38","v":23381.119999999999},{"$f":"+Complete!I38","v":17697.12},{"$f":"+Complete!J38","v":13496}]
[]
[]
{"$rows_left_out":97}
{"sheet":"Tablas","index":7,"n_rows":1208,"n_cols":12,"rows_kept":1208,"cut":false,"hidden":true,"merged":[[1137,0,1137,7],[1138,0,1138,1],[1138,2,1138,6],[1062,0,1062,1],[1062,2,1062,6],[987,0,987,7],[988,0,988,1],[988,2,988,6],[1060,0,1060,7],[1061,0,1061,7],[952,0,952,7],[953,0,953,7],[954,0,954,1],[954,2,954,6],[986,0,986,7],[918,0,918,7],[919,0,919,7],[920,0,920,1],[920,2,920,6],[1,0,1,7],[2,0,2,7],[36,0,36,1],[36,2,36,6],[35,0,35,7],[3,0,3,1],[3,2,3,6],[135,0,135,7],[69,0,69,7],[70,0,70,1],[70,2,70,6],[203,0,203,7],[136,0,136,7],[137,0,137,1],[137,2,137,6],[169,0,169,7],[170,0,170,1],[68,0,68,7],[102,0,102,7],[103,0,103,1],[103,2,103,6],[342,0,342,7],[269,0,269,7],[270,0,270,7],[271,0,271,1],[271,2,271,6],[170,2,170,6],[202,0,202,7],[236,0,236,7],[237,0,237,1],[237,2,237,6],[204,0,204,1],[204,2,204,6],[628,0,628,7],[482,0,482,7],[483,0,483,7],[484,0,484,1],[484,2,484,6],[343,2,343,6],[415,0,415,7],[555,0,555,7],[556,0,556,1],[556,2,556,6],[343,0,343,1],[449,0,449,7],[450,0,450,1],[450,2,450,6],[416,0,416,7],[417,0,417,1],[417,2,417,6],[629,0,629,7],[630,0,630,1],[630,2,630,6],[701,0,701,7],[702,0,702,1],[702,2,702,6],[847,0,847,1],[847,2,847,6],[773,0,773,7],[774,0,774,7],[775,0,775,1],[775,2,775,6],[846,0,846,7]]}
[]
["BUPA COMPLETE GUATEMALA",null,null,null,null,null,null,null,null,"FACTOR SEMESTRAL :",null,0.53]
["TARIFAS ANUALES",null,null,null,null,null,null,null,null,"FACTOR TRIMESTRAL :",null,0.27500000000000002]
["EDAD"]
[" "," ","DW1","DW2","DW3","DW4","DW5","DW6"]
[18,"-  24",19769,12028,8238,5783,3992,3051,null,"Descuento (15%)",null,1]
[25,"-  29",20759,12602,9147,6426,4379,3365]
[30,"-  34",21668,13182,9802,7149,5322,4071]
[35,"-  39",24218,14748,10958,8028,5945,4540]
[40,"-  44",27430,17132,12028,8914,6570,5006]
[45,"-  49",30644,19113,13428,9954,7353,5632]
[50,"-  54",40445,24958,17712,13088,10480,8058]
[55,"-  59",42996,26604,18863,13970,11181,8525]
[60,null,45633,28913,20513,15896,13293,10712]
[61,null,49010,31053,21998,17020,14310,11496]
[62,null,53622,34018,24054,18627,15635,12587]
[63,null,57000,36160,25617,19832,16656,13370]
[64,null,61695,39125,27678,21438,17985,14466]
[65,null,64655,51153,36160,27135,24004,20405]
[66,null,67540,59469,42010,31547,27914,23688]
[67,null,73800,64906,45881,34436,30492,25880]
[68,null,81624,71906,50820,38130,33774,28694]
[69,null,89775,79073,55847,41985,37136,31505]
[70,null,106253,97355,68033,49366,43234,37058]
[71,null,110454,101145,70673,51297,44955,38544]
[72,null,113583,104027,72730,52740,46204,39639]
[73,null,117700,107817,75368,54670,47922,41123]
[74,null,119840,109794,76684,55712,48784,41828]
[75,"o más",125032,114570,80058,58115,50896,43624]
[1,"Hijo",6674,4205,3050,2333,1958,1409]
{"$rows_left_out":1178}