{"text_format":"1","workbook":"xlsx","n_sheets":9,"sheets":["INGRESO DE DATOS","Global Major Medical Health Pla","Global Select Health Plan","Global Premier Health Plan","Global Select PE Health Plan","Global Elite Health Plan","Global Ultimate Health Plan","Resumen tarifas","Tablas"],"not_rendered":{"charts":0,"images":23,"macros":1,"external_links":1,"defined_names":6,"comments":1,"pivot_tables":0},"unopened":[],"bounds":{"document_bytes":16777216,"sheet_cells":100000,"rows_first":2000,"rows_last":500,"rows_between":2000,"halvings":0,"cell_chars":16384,"cell_head_chars":4096},"cells_cut":0,"cells_raw":0,"read":"whole","date_system":"1900"}

{"sheet":"INGRESO DE DATOS","index":0,"n_rows":31,"n_cols":13,"rows_kept":31,"cut":false,"hidden":false,"merged":[[10,0,10,7],[28,1,28,2],[16,1,16,2],[28,3,28,5],[14,3,14,7],[16,5,16,6],[14,1,14,2],[18,1,18,2],[18,5,18,6],[24,1,24,2],[20,5,24,5]]}
[]
[null,null,null,null,null,null,null," "," "]
[]
[]
[]
[null,null,null,null,null,null,null," "," "," "]
[]
[]
[]
[]
["Cotización de Seguro Médico - Bupa Global Health Plans"]
[null,null,null,null,null,null,null,"Última actualización  del archivo: 10 octubre 2022"]
["1. INGRESE LOS DATOS DEL PROPUESTO ASEGURADO :"]
[null,null,null,null,null,null,null,null,null,"Diligenciar, solo si aplica otros dependientes, incluir edad"]
[null,"Nombre del asegurado titular :",null,"JUAN VIDAL",null,null,null,null,null,"Otros dependientes:","ID","Edad"]
[null,null,null,null,null,null,null,null,null,null,1,null,{"$f":"IF(ISBLANK(L16),TRUE,AND(L16 >= 0,L16 <= 24,E25))","v":true}]
[null,"Número de adultos en la póliza : ",null,null,null,"Número de hijos en la póliza :",null,null,null,null,2,null,{"$f":"IF(ISBLANK(L17),TRUE,AND(L17 >= 0,L17 <= 24,E26))","v":true}]
[null,null,null,null,null,null,null,null,null,null,3,null,{"$f":"IF(ISBLANK(L18),TRUE,AND(L18 >= 0,L18 <= 24,E27))","v":true}]
[null," Edad del asegurado titular :",null,null,{"$f":"AND(D19 >= 18,D19 <= 45,E25)","v":false},"Edad del (de la) cónyuge :",null,null,{"$f":"IF(D17>1,AND(H19 >= 18,H19 <= 45,E25),TRUE)","v":true},null,4,null,{"$f":"IF(ISBLANK(L19),TRUE,AND(L19 >= 0,L19 <= 24,E28))","v":true}]
[null,null,null,null,null,null,null,null,null,null,5,null,{"$f":"IF(ISBLANK(L20),TRUE,AND(L20 >= 0,L20 <= 24,E29))","v":true}]
[null,null,"Aplica descuento especial del 10%:",null,false,"*Descuento especial aplica para todos los productos globales a excepción de Select PE.\n\n*Descuento por pago fraccionado aplica para todos los productos globales.\n\n*Descuento por promo especial, aplica para todos los productos globales a excepción de Select PE."]
[]
[null,null,"Aplica descuento por pago fraccionado:",null,false]
[]
[null,"Promo especial +10% adicional (Valido para asegurados entre los 18 y 45 años)",null,null,false]
[null,null,null,{"$f":"1-(IF(E21,0.1,0)+IF(AND(E19,I19,M16,M17,M18,M19,M20),0.1,0))","v":1},{"$f":"1-IF(E21,0.1,0)","v":1}]
["2. INGRESE EL NOMBRE DE LA AGENCIA ASESORA :"]
[]
[null,"Agencia / Agente :",null,"Nombre del Agente"]
[]
{"$rows_left_out":2}
{"sheet":"Global Major Medical Health Pla","index":1,"n_rows":77,"n_cols":15,"rows_kept":77,"cut":false,"hidden":false,"merged":[[74,1,74,8],[75,10,75,11],[76,10,76,11],[68,10,68,11],[69,10,69,11],[71,10,71,11],[72,10,72,11],[73,10,73,11],[74,10,74,11],[63,10,63,11],[64,10,64,11],[66,10,66,13],[67,10,67,11],[73,1,73,8],[68,1,68,8],[69,1,69,8],[70,1,70,8],[71,1,71,8],[72,1,72,8],[57,10,57,11],[59,10,59,11],[60,10,60,11],[61,10,61,11],[62,10,62,11],[28,10,28,11],[43,0,44,0],[43,6,44,6],[22,0,22,6],[32,3,32,4],[34,3,34,4],[36,2,36,3],[36,4,36,5],[28,2,28,8],[30,2,30,8],[29,10,29,11],[30,10,30,11],[32,10,32,13],[33,10,33,11],[34,10,34,11],[35,10,35,11],[37,10,37,11],[38,10,38,11],[39,10,39,11],[40,10,40,11],[42,10,42,13],[36,10,36,11],[46,10,46,11],[58,10,58,11],[70,10,70,11],[43,10,43,11],[44,10,44,11],[45,10,45,11],[47,10,47,11],[48,10,48,11],[49,10,49,11],[50,10,50,11],[51,10,51,11],[52,10,52,11],[54,10,54,13],[55,10,55,11],[56,10,56,11]]}
[]
[]
[null,null,null,null,null,null,null,null,null,null,null,null," "," "," "]
[]
[]
[]
[null,null,null,null,null,null,null,null,null,null,null,null," "," "," "]
[]
[]
[]
[]
[]
[]
[]
[]
[]
[]
[]
[]
[]
[]
[]
[]
[]
[]
[]
[]
[null,null,null,null,null,null,null,null,null,null,null," ",false]
[null,"Nombre del asegurado titular :",{"$f":"+'INGRESO DE DATOS'!$D$15","v":"JUAN VIDAL"},null,null,null,null,null,null,null,"Deducibles",null,"PLAN 1","PLAN 2"]
[null,null,null,null,null,null,null,null,null,null,"Dentro del país de residencia",null,10000,20000]
{"$rows_left_out":48}
{"sheet":"Global Select Health Plan","index":2,"n_rows":81,"n_cols":17,"rows_kept":81,"cut":false,"hidden":false,"merged":[[74,10,74,11],[73,10,73,11],[75,10,75,11],[80,10,80,11],[76,10,76,11],[77,10,77,11],[78,10,78,11],[79,10,79,11],[22,0,22,1],[44,10,44,11],[28,0,28,1],[32,10,32,11],[38,10,38,11],[32,2,32,8],[34,2,34,8],[33,10,33,11],[34,10,34,11],[37,10,37,11],[39,10,39,11],[36,10,36,16],[41,10,41,11],[42,10,42,11],[40,10,40,11],[41,1,41,2],[47,0,48,0],[47,1,48,1],[56,10,56,11],[54,10,54,11],[55,10,55,11],[48,10,48,11],[49,10,49,11],[51,10,51,11],[52,10,52,11],[53,10,53,11],[50,10,50,11],[61,10,61,11],[63,10,63,11],[64,10,64,11],[59,10,59,11],[60,10,60,11],[62,10,62,11],[41,3,41,4],[46,10,46,16],[58,10,58,16],[43,10,43,11],[47,10,47,11],[77,1,77,8],[78,1,78,8],[72,1,72,8],[73,1,73,8],[74,1,74,8],[75,1,75,8],[76,1,76,8],[66,10,66,11],[65,10,65,11],[67,10,67,11],[71,10,71,11],[72,10,72,11],[68,10,68,11],[70,10,70,16]]}
[]
[]
[null,null,null,null,null,null,null,null,null,null,null,null," "," "," "]
[]
[]
[]
[null,null,null,null,null,null,null,null,null,null,null,null," "," "," "]
[]
[]
[]
[]
[]
[]
[]
[]
[]
[]
[]
[]
[]
[]
[]
[]
[]
[]
[]
[]
[]
[]
[]
{"$rows_left_out":52}
{"sheet":"Global Premier Health Plan","index":3,"n_rows":84,"n_cols":17,"rows_kept":84,"cut":false,"hidden":false,"merged":[[82,1,83,8],[79,11,79,12],[80,11,80,12],[81,11,81,12],[82,11,82,12],[81,1,81,8],[79,1,79,8],[80,1,80,8],[50,0,51,0],[25,0,25,1],[71,11,71,12],[83,11,83,12],[49,11,49,16],[61,11,61,16],[54,11,54,12],[55,11,55,12],[56,11,56,12],[57,11,57,12],[58,11,58,12],[62,11,62,12],[63,11,63,12],[64,11,64,12],[66,11,66,12],[67,11,67,12],[35,11,35,12],[39,11,39,16],[35,2,35,8],[37,2,37,8],[36,11,36,12],[37,11,37,12],[40,11,40,12],[41,11,41,12],[42,11,42,12],[44,11,44,12],[45,11,45,12],[43,1,43,2],[43,3,43,4],[46,11,46,12],[50,1,51,1],[68,11,68,12],[50,11,50,12],[51,11,51,12],[52,11,52,12],[47,11,47,12],[53,11,53,12],[43,11,43,12],[69,11,69,12],[70,11,70,12],[59,11,59,12],[65,11,65,12],[74,11,74,12],[73,11,73,16],[76,1,76,8],[77,1,77,8],[78,1,78,8],[75,11,75,12],[76,11,76,12],[78,11,78,12],[77,11,77,12]]}
[]
[]
[]
[]
[]
[null,null,null,null,null,null,null,null,null,null,null,null,null," "," "," "]
[]
[]
[]
[null,null,null,null,null,null,null,null,null,null,null,null,null," "," "," "]
[]
[]
[]
[]
[]
[]
[]
[]
[]
[]
[]
[]
[]
[]
[]
[]
[]
[]
[]
[]
{"$rows_left_out":55}
{"sheet":"Global Select PE Health Plan","index":4,"n_rows":81,"n_cols":17,"rows_kept":81,"cut":false,"hidden":false,"merged":[[34,2,34,8],[34,10,34,11],[22,0,22,1],[28,0,28,1],[32,2,32,8],[32,10,32,11],[33,10,33,11],[47,0,48,0],[47,1,48,1],[48,10,48,11],[49,10,49,11],[36,10,36,16],[37,10,37,11],[38,10,38,11],[39,10,39,11],[41,10,41,11],[42,10,42,11],[43,10,43,11],[44,10,44,11],[46,10,46,16],[47,10,47,11],[40,10,40,11],[41,1,41,2],[41,3,41,4],[79,10,79,11],[80,10,80,11],[72,10,72,11],[73,10,73,11],[75,10,75,11],[76,10,76,11],[77,10,77,11],[78,10,78,11],[71,10,71,11],[58,10,58,16],[59,10,59,11],[68,1,68,8],[78,1,78,8],[53,10,53,11],[80,1,81,8],[74,1,74,8],[66,10,66,11],[67,10,67,11],[74,10,74,11],[62,10,62,11],[70,10,70,16],[64,10,64,11],[70,1,70,7],[71,1,71,7],[72,1,72,7],[73,1,73,7],[50,10,50,11],[52,10,52,11],[63,10,63,11],[69,1,69,8],[79,1,79,8],[60,10,60,11],[61,10,61,11],[56,10,56,11],[51,10,51,11],[54,10,54,11],[55,10,55,11],[65,10,65,11],[75,1,75,8],[76,1,76,8],[77,1,77,8],[68,10,68,11]]}
[]
[]
[null,null,null,null,null,null,null,null,null,null,null,null," "," "," "]
[]
[]
[]
[null,null,null,null,null,null,null,null,null,null,null,null," "," "," "]
[]
[]
[]
[]
[]
[]
[]
[]
[]
[]
[]
[]
[]
[]
[]
[]
[]
[]
[]
[]
[]
[]
[]
{"$rows_left_out":52}
{"sheet":"Global Elite Health Plan","index":5,"n_rows":74,"n_cols":57,"rows_kept":74,"cut":false,"hidden":false,"merged":[[54,10,54,11],[53,10,53,11],[43,10,43,11],[33,10,33,11],[32,10,32,11],[34,10,34,11],[35,10,35,11],[51,10,51,16],[44,10,44,11],[48,10,48,11],[42,10,42,11],[49,10,49,11],[31,4,31,5],[31,1,31,2],[29,1,29,2],[30,10,30,11],[31,10,31,11],[25,2,25,8],[27,2,27,8],[29,10,29,16],[27,10,27,11],[26,10,26,11],[25,10,25,11],[29,4,29,5],[72,10,72,11],[73,10,73,11],[52,10,52,11],[56,10,56,11],[57,10,57,11],[58,10,58,11],[65,10,65,11],[66,10,66,11],[68,10,68,11],[67,10,67,11],[69,10,69,11],[70,10,70,11],[71,10,71,11],[55,10,55,11],[60,10,60,11],[61,10,61,11],[71,1,72,8],[65,1,65,8],[66,1,66,8],[67,1,67,8],[68,1,68,8],[69,1,69,8],[33,1,33,2],[33,3,33,4],[70,1,70,8],[45,10,45,11],[46,10,46,11],[47,10,47,11],[59,10,59,11],[40,2,41,2],[37,10,37,11],[36,10,36,11],[39,10,39,16],[40,1,41,1],[40,10,40,11],[41,10,41,11],[64,10,64,11],[63,10,63,16]]}
[]
[]
[]
[]
[]
[]
[]
[]
[null,null,null,null,null,null,null,null,null,null,null,null,null,null,null,null,null,null,null,null,null,null,null,null,null,null,null,null,null,null,null,null,null,null,null,null,null,null,null,null,null,null,null,null,null,null,null,null,null,null,null,null,null,null,null,null," "]
[]
[]
[]
[null,null,null,null,null,null,null,null,null,null,null,null,null," "," "," "]
[]
[]
[]
[]
[]
[]
[]
[]
[]
[]
[]
[]
[null,"Nombre del asegurado titular :",{"$f":"+'INGRESO DE DATOS'!$D$15","v":"JUAN VIDAL"},null,null,null,null,null,null,null,"Deducibles",null,"PLAN 1","PLAN 2","PLAN 3","PLAN 4","PLAN 5"]
[null,null,null,null,null,null,null,null,null,null,"Dentro del país de residencia",null,1000,2000,3500,5000,10000]
[null,"Agencia / Agente :",{"$f":"+'INGRESO DE DATOS'!$D$29","v":"Nombre del Agente"},null,null,null,null,null,null,null,"Fuera del país de residencia",null,1000,2000,3500,5000,10000]
[]
[null,"Número de adultos en la póliza : ",null,{"$f":"+'INGRESO DE DATOS'!$D$17","v":0}," Edad del asegurado titular :",null,{"$f":"+'INGRESO DE DATOS'!$D$19","v":0},null,{"$f":"VLOOKUP($D$30,Tablas!A1503:B1504,2,0)","v":{"$error":"#N/A"}},null,"TARIFAS ANUALES"]
{"$rows_left_out":45}
{"sheet":"Global Ultimate Health Plan","index":6,"n_rows":68,"n_cols":16,"rows_kept":68,"cut":false,"hidden":false,"merged":[[66,11,66,12],[23,4,23,5],[25,4,25,5],[19,2,19,8],[21,2,21,8],[23,1,23,2],[25,1,25,2],[25,11,25,12],[26,11,26,12],[19,11,19,12],[20,11,20,12],[21,11,21,12],[24,11,24,12],[23,11,23,15],[28,11,28,12],[29,11,29,12],[31,11,31,12],[34,11,34,12],[35,11,35,12],[36,11,36,12],[46,11,46,12],[33,11,33,15],[37,11,37,12],[27,1,27,2],[27,3,27,4],[47,11,47,12],[48,11,48,12],[50,11,50,12],[35,6,36,6],[35,7,36,7],[30,11,30,12],[45,11,45,15],[38,11,38,12],[39,11,39,12],[40,11,40,12],[41,11,41,12],[42,11,42,12],[43,11,43,12],[49,11,49,12],[64,1,64,9],[65,1,66,9],[59,1,59,9],[60,1,60,9],[61,1,61,9],[62,1,62,9],[63,1,63,9],[27,11,27,12],[67,11,67,12],[53,11,53,12],[54,11,54,12],[55,11,55,12],[58,11,58,12],[59,11,59,12],[57,11,57,15],[60,11,60,12],[62,11,62,12],[63,11,63,12],[64,11,64,12],[65,11,65,12],[61,11,61,12],[51,11,51,12],[52,11,52,12]]}
[]
[]
[]
[]
[]
[]
[]
[null,null,null,null,null,null,null,null,null,null,null,null,null," "," "," "]
[]
[]
[]
[null,null,null,null,null,null,null,null,null,null,null,null,null," "," "," "]
[]
[]
[]
[]
[]
[]
[null,null,null,null,null,null,null,null,null,null,null,null," ",false]
[null,"Nombre del asegurado titular :",{"$f":"+'INGRESO DE DATOS'!$D$15","v":"JUAN VIDAL"},null,null,null,null,null,null,null,null,"Deducibles",null,"PLAN 1","PLAN 2","PLAN 3"]
[null,null,null,null,null,null,null,null,null,null,null,"Dentro del país de residencia",null,0,1000,2000]
[null,"Agencia / Agente :",{"$f":"+'INGRESO DE DATOS'!$D$29","v":"Nombre del Agente"},null,null,null,null,null,null,null,null,"Fuera del país de residencia",null,0,1000,2000]
[]
[null,"Número de adultos en la póliza : ",null,{"$f":"+'INGRESO DE DATOS'!$D$17","v":0}," Edad del asegurado titular :",null,{"$f":"+'INGRESO DE DATOS'!$D$19","v":0},{"$f":"VLOOKUP($D$24,Tablas!A1503:B1504,2,0)","v":{"$error":"#N/A"}},null,null,null,"TARIFAS ANUALES"]
[null,null,null,null,null,null,null,null,null,null,null,"Prima del asegurado titular :",null,{"$f":"(VLOOKUP($G$24,Tablas!$A$1205:$G$1271,3,TRUE))*'INGRESO DE DATOS'!$D$26+(Tablas!$Q$2)","v":{"$error":"#N/A"}},{"$f":"(VLOOKUP($G$24,Tablas!$A$1205:$G$1271,4,TRUE))*'INGRESO DE DATOS'!$D$26+(Tablas!$Q$2)","v":{"$error":"#N/A"}},{"$f":"(VLOOKUP($G$24,Tablas!$A$1205:$G$1271,5,TRUE))*'INGRESO DE DATOS'!$D$26+(Tablas!$Q$2)","v":{"$error":"#N/A"}}]
[null,"Número de hijos en la póliza :",null,{"$f":"+'INGRESO DE DATOS'!$H$17","v":0},"Edad del (de la) cónyuge :",null,{"$f":"+'INGRESO DE DATOS'!$H$19","v":0},null,null,null,null,"Prima del (de la) cónyuge:",null,{"$f":"(IF($D$24=1,0,(VLOOKUP($G$26,Tablas!$A$1205:$G$1271,3,TRUE))))*'INGRESO DE DATOS'!$D$26+(IF($D$24=1,0,(Tablas!$Q$2)))","v":{"$error":"#N/A"}},{"$f":"(IF($D$24=1,0,(VLOOKUP($G$26,Tablas!$A$1205:$G$1271,4,TRUE))))*'INGRESO DE DATOS'!$D$26+(IF($D$24=1,0,(Tablas!$Q$2)))","v":{"$error":"#N/A"}},{"$f":"(IF($D$24=1,0,(VLOOKUP($G$26,Tablas!$A$1205:$G$1271,5,TRUE))))*'INGRESO DE DATOS'!$D$26+(IF($D$24=1,0,(Tablas!$Q$2)))","v":{"$error":"#N/A"}}]
[null,null,null,null,null,null,null,null,null,null,null,"Prima del (de los) Hijo (s) :",null,{"$f":"IF($D$26=0,0,(VLOOKUP($D$26,Tablas!$A$1272:$G$1274,3,TRUE)))*'INGRESO DE DATOS'!$D$26","v":0},{"$f":"IF($D$26=0,0,(VLOOKUP($D$26,Tablas!$A$1272:$G$1274,4,TRUE)))*'INGRESO DE DATOS'!$D$26","v":0},{"$f":"IF($D$26=0,0,(VLOOKUP($D$26,Tablas!$A$1272:$G$1274,5,TRUE)))*'INGRESO DE DATOS'!$D$26","v":0}]
[null,"FECHA DE COTIZACION :",null,{"$f":"NOW()","v":"2023-10-26T13:25:47.830"},null,null,null,null,null,null,null,"Total otros dependientes",null,{"$f":"Tablas!Q1206*'INGRESO DE DATOS'!$D$26","v":0},{"$f":"Tablas!R1206*'INGRESO DE DATOS'!$D$26","v":0},{"$f":"Tablas!S1206*'INGRESO DE DATOS'!$D$26","v":0}]
[null,null,null,null,null,null,null,null,null,null,null,"TOTAL PRIMA NETA :",null,{"$f":"SUM(N25:N28)","v":{"$error":"#N/A"}},{"$f":"SUM(O25:O28)","v":{"$error":"#N/A"}},{"$error":"#N/A"}]
[null,null,null,null,null,null,null,null,null,null,null,"Costo administrativo anual :",null,937.5,937.5,937.5]
{"$rows_left_out":39}
{"sheet":"Resumen tarifas","index":7,"n_rows":126,"n_cols":7,"rows_kept":126,"cut":false,"hidden":false,"merged":[[125,0,128,6],[43,0,43,1],[39,0,39,1],[40,0,40,1],[41,0,41,1],[119,0,119,1],[115,0,115,1],[116,0,116,1],[116,2,116,3],[117,0,117,1],[118,0,118,1],[118,2,118,3],[112,0,112,1],[112,2,112,3],[100,0,100,6],[113,0,113,1],[77,0,77,1],[81,0,81,1],[78,0,78,1],[114,0,114,1],[106,0,106,6],[101,0,101,5],[102,0,102,5],[103,0,103,5],[104,0,104,5],[114,2,114,3],[109,0,109,1],[79,0,79,1],[80,0,80,1],[82,0,82,1],[83,0,83,1],[95,0,95,1],[96,0,96,1],[96,2,96,6],[97,0,97,1],[91,0,91,1],[92,0,92,1],[92,2,92,6],[93,0,93,1],[94,0,94,1],[94,2,94,6],[78,2,78,6],[80,2,80,6],[82,2,82,6],[87,0,87,1],[90,0,90,1],[90,2,90,6],[86,0,86,2],[59,0,59,1],[67,0,67,1],[49,2,49,6],[51,2,51,6],[53,2,53,6],[55,2,55,6],[62,2,62,5],[62,0,62,1],[63,0,63,1],[66,0,66,1],[76,2,76,6],[68,0,68,1],[64,0,64,1],[65,0,65,1],[72,0,72,2],[16,0,16,6],[18,0,18,1],[22,4,22,5],[25,4,25,5],[45,0,45,1],[18,2,18,6],[20,2,20,6],[20,0,20,1],[22,0,22,1],[25,0,25,1],[32,0,32,1],[33,0,33,1],[36,0,36,1],[37,0,37,1],[38,0,38,1],[42,0,42,1],[123,0,123,6],[46,0,46,1],[55,0,55,1],[56,0,56,1],[49,0,49,1],[50,0,50,1],[51,0,51,1],[52,0,52,1],[53,0,53,1],[54,0,54,1],[69,0,69,1],[73,0,73,1],[76,0,76,1],[64,2,64,5],[66,2,66,5],[68,2,68,5]]}
[" "]
[null,null,null,null," "," "]
[]
[]
[]
[null,null,null,null," "," "," "]
[]
[]
[]
[]
[]
[]
[]
[]
[]
[]
["Cotización de Seguro Médico - Bupa Global Health Plans"]
[]
["Nombre del asegurado titular :",null,{"$f":"+'INGRESO DE DATOS'!$D$15","v":"JUAN VIDAL"}]
[]
["Agencia / Agente :",null,{"$f":"+'INGRESO DE DATOS'!$D$29","v":"Nombre del Agente"}]
[]
["Número de adultos en la póliza : ",null,{"$f":"'INGRESO DE DATOS'!D17","v":0},null," Edad del asegurado titular :",null,{"$f":"'INGRESO DE DATOS'!D19","v":0}]
[]
[]
["Número de hijos en la póliza :",null,{"$f":"'INGRESO DE DATOS'!H17","v":0},null,"Edad del (de la) cónyuge :",null,{"$f":"'INGRESO DE DATOS'!H19","v":0}]
[]
[]
[null,null,null,"FECHA DE COTIZACION :",{"$f":"NOW()","v":"2023-10-26T13:25:47.840"}]
[]
{"$rows_left_out":97}
{"sheet":"Tablas","index":8,"n_rows":1581,"n_cols":23,"rows_kept":1581,"cut":false,"hidden":true,"merged":[[1507,0,1507,6],[1508,0,1508,6],[1509,0,1509,1],[1509,2,1509,6],[1438,28,1438,29],[1439,28,1439,29],[1440,28,1440,29],[2,20,2,23],[151,20,151,23],[301,20,301,23],[901,20,901,23],[1201,20,1201,23],[4,8,4,12],[1424,0,1424,6],[1425,0,1425,6],[1426,0,1426,1],[1426,2,1426,6],[1276,0,1276,1],[1276,2,1276,6],[1349,0,1349,6],[1350,0,1350,6],[1351,0,1351,1],[1351,2,1351,6],[1200,0,1200,6],[1201,0,1201,6],[1202,0,1202,1],[1202,2,1202,6],[1275,0,1275,6],[976,2,976,6],[1049,0,1049,6],[1050,0,1050,6],[1051,0,1051,1],[1051,2,1051,6],[1,0,1,6],[2,0,2,6],[77,0,77,1],[77,2,77,6],[76,0,76,6],[3,0,3,1],[3,2,3,6],[376,0,376,1],[376,2,376,6],[150,0,150,6],[151,0,151,6],[152,0,152,1],[152,2,152,6],[225,0,225,6],[226,0,226,1],[375,0,375,6],[226,2,226,6],[300,0,300,6],[301,0,301,6],[302,0,302,1],[302,2,302,6],[526,0,526,6],[450,0,450,6],[451,0,451,6],[452,0,452,1],[452,2,452,6],[525,0,525,6],[527,0,527,1],[527,2,527,6],[600,0,600,6],[601,0,601,6],[602,0,602,1],[602,2,602,6],[751,0,751,6],[675,0,675,6],[676,0,676,6],[677,0,677,1],[677,2,677,6],[750,0,750,6],[1124,0,1124,6],[1125,0,1125,6],[1126,0,1126,1],[1126,2,1126,6],[752,0,752,1],[752,2,752,6],[825,0,825,6],[826,0,826,6],[827,0,827,1],[827,2,827,6],[900,0,900,6],[901,0,901,6],[902,0,902,1],[902,2,902,6],[975,0,975,6],[976,0,976,1]]}
[]
["BUPA GLOBAL ELITE",null,null,null,null,null,null,null,"FACTOR MENSUAL:",null,{"$f":"IF('INGRESO DE DATOS'!E23,0,0.09)","v":0.09},null,"% Anteriores",9.2499999999999999E-2,null,"Usamed",625]
["TARIFAS ANUALES",null,null,null,null,null,null,null,"FACTOR TRIMESTRAL:",null,{"$f":"IF('INGRESO DE DATOS'!E23,0,0.075)","v":7.4999999999999997E-2},null,null,0.26874999999999999,null,null,null,null,null,null,1000]
["EDAD",null,null,null,null,null,null,null,"FACTOR SEMIANUAL:",null,{"$f":"IF('INGRESO DE DATOS'!E23,0,0.045)","v":4.4999999999999998E-2},null,null,0.52249999999999996,null,null,null,null,null,null,2,0,4.4999999999999998E-2]
[" "," ",1000,2000,3500,5000,10000,null,"THIS COLUMN IS FOR THE 5% DISCOUNT ",null,null,null,null,null,"Otros dependientes panel"]
[18,null,154112.5,110962.5,86300,75512.5,58562.5,null,96337.5,69712.5,54087.5,47025,36650,null,"Edad otros dependientes","ID",1000,2000,3500,5000,10000]
[19,null,159300,114687.5,89200,78050,60537.5,null,100062.5,72400,56187.5,48812.5,38075,null,{"$f":"'INGRESO DE DATOS'!$L$16","v":0},1,{"$f":"IF(O7>0,(IF(O7>18,VLOOKUP(O7,$A$6:$G$72,3,FALSE),Tablas!$C$6)),0)","v":0},{"$f":"IF(O7>0,(IF(O7>18,VLOOKUP(O7,$A$6:$G$72,4,FALSE),Tablas!$D$6)),0)","v":0},{"$f":"IF(O7>0,(IF(O7>18,VLOOKUP(O7,$A$6:$G$72,5,FALSE),Tablas!$E$6)),0)","v":0},{"$f":"IF(O7>0,(IF(O7>18,VLOOKUP(O7,$A$6:$G$72,6,FALSE),Tablas!$F$6)),0)","v":0},{"$f":"IF(O7>0,(IF(O7>18,VLOOKUP(O7,$A$6:$G$72,7,FALSE),Tablas!$G$6)),0)","v":0}]
[20,null,164650,118550,92212.5,80675,62575,null,104037.5,75275,58425,50775,39575,null,{"$f":"'INGRESO DE DATOS'!$L$17","v":0},2,{"$f":"IF(O8>0,(IF(O8>18,VLOOKUP(O8,$A$6:$G$72,3,FALSE),Tablas!$C$6)),0)","v":0},{"$f":"IF(O8>0,(IF(O8>18,VLOOKUP(O8,$A$6:$G$72,4,FALSE),Tablas!$D$6)),0)","v":0},{"$f":"IF(O8>0,(IF(O8>18,VLOOKUP(O8,$A$6:$G$72,5,FALSE),Tablas!$E$6)),0)","v":0},{"$f":"IF(O8>0,(IF(O8>18,VLOOKUP(O8,$A$6:$G$72,6,FALSE),Tablas!$F$6)),0)","v":0},{"$f":"IF(O8>0,(IF(O8>18,VLOOKUP(O8,$A$6:$G$72,7,FALSE),Tablas!$G$6)),0)","v":0}]
[21,null,170200,122537.5,95312.5,83400,64675,null,107950,78100,60550,52612.5,41012.5,null,{"$f":"'INGRESO DE DATOS'!$L$18","v":0},3,{"$f":"IF(O9>0,(IF(O9>18,VLOOKUP(O9,$A$6:$G$72,3,FALSE),Tablas!$C$6)),0)","v":0},{"$f":"IF(O9>0,(IF(O9>18,VLOOKUP(O9,$A$6:$G$72,4,FALSE),Tablas!$D$6)),0)","v":0},{"$f":"IF(O9>0,(IF(O9>18,VLOOKUP(O9,$A$6:$G$72,5,FALSE),Tablas!$E$6)),0)","v":0},{"$f":"IF(O9>0,(IF(O9>18,VLOOKUP(O9,$A$6:$G$72,6,FALSE),Tablas!$F$6)),0)","v":0},{"$f":"IF(O9>0,(IF(O9>18,VLOOKUP(O9,$A$6:$G$72,7,FALSE),Tablas!$G$6)),0)","v":0}]
[22,null,175925,126662.5,98512.5,86200,66850,null,111662.5,80750,62612.5,54412.5,42400,null,{"$f":"'INGRESO DE DATOS'!$L$19","v":0},4,{"$f":"IF(O10>0,(IF(O10>18,VLOOKUP(O10,$A$6:$G$72,3,FALSE),Tablas!$C$6)),0)","v":0},{"$f":"IF(O10>0,(IF(O10>18,VLOOKUP(O10,$A$6:$G$72,4,FALSE),Tablas!$D$6)),0)","v":0},{"$f":"IF(O10>0,(IF(O10>18,VLOOKUP(O10,$A$6:$G$72,5,FALSE),Tablas!$E$6)),0)","v":0},{"$f":"IF(O10>0,(IF(O10>18,VLOOKUP(O10,$A$6:$G$72,6,FALSE),Tablas!$F$6)),0)","v":0},{"$f":"IF(O10>0,(IF(O10>18,VLOOKUP(O10,$A$6:$G$72,7,FALSE),Tablas!$G$6)),0)","v":0}]
[23,null,181837.5,130925,101825,89100,69100,null,115587.5,83612.5,64825,56312.5,43875,null,{"$f":"'INGRESO DE DATOS'!$L$20","v":0},5,{"$f":"IF(O11>0,(IF(O11>18,VLOOKUP(O11,$A$6:$G$72,3,FALSE),Tablas!$C$6)),0)","v":0},{"$f":"IF(O11>0,(IF(O11>18,VLOOKUP(O11,$A$6:$G$72,4,FALSE),Tablas!$D$6)),0)","v":0},{"$f":"IF(O11>0,(IF(O11>18,VLOOKUP(O11,$A$6:$G$72,5,FALSE),Tablas!$E$6)),0)","v":0},{"$f":"IF(O11>0,(IF(O11>18,VLOOKUP(O11,$A$6:$G$72,6,FALSE),Tablas!$F$6)),0)","v":0},{"$f":"IF(O11>0,(IF(O11>18,VLOOKUP(O11,$A$6:$G$72,7,FALSE),Tablas!$G$6)),0)","v":0}]
[24,null,187962.5,135325,105262.5,92100,71425,null,119475,86375,66975,58187.5,45312.5,null,null,"Total",{"$f":"SUM(Q7:Q11)","v":0},{"$f":"SUM(R7:R11)","v":0},{"$f":"SUM(S7:S11)","v":0},0,0]
[25,null,194287.5,139887.5,108800,95200,73825,null,123187.5,89037.5,69025,59975,46700]
[26,null,200825,144587.5,112462.5,98400,76312.5,null,127100,91887.5,71225,61875,48187.5]
[27,null,207575,149462.5,116250,101712.5,78875,null,131000,94687.5,73400,63762.5,49650]
[28,null,214562.5,154487.5,120150,105137.5,81537.5,null,135000,97525,75625,65675,51137.5]
[29,null,221787.5,159687.5,124200,108675,84275,null,140075,101187.5,78437.5,68125,53025]
[30,null,229250,165062.5,128375,112325,87112.5,null,145362.5,105012.5,81337.5,70662.5,55000]
[31,null,236962.5,170612.5,132700,116112.5,90050,null,150587.5,108800,84300,73200,56975]
[32,null,244937.5,176350,137162.5,120012.5,93075,null,155975,112637.5,87262.5,75800,58975]
[33,null,253175,182287.5,141775,124050,96212.5,null,159162.5,114950,89037.5,77312.5,60150]
[34,null,263012.5,189362.5,147287.5,128875,99950,null,162550,117387.5,90900,78950,61412.5]
[35,null,267325,192475,149700,130987.5,101587.5,null,165900,119800,92787.5,80575,62675]
[36,null,271712.5,195637.5,152162.5,133137.5,103250,null,169262.5,122237.5,94650,82175,63937.5]
[37,null,276175,198850,154662.5,135325,104950,null,172612.5,124637.5,96512.5,83787.5,65187.5]
[38,null,280700,202112.5,157200,137550,106662.5,null,175550,126737.5,98112.5,85187.5,66262.5]
[39,null,285312.5,205425,159775,139800,108425,null,178275,128737.5,99675,86550,67312.5]
[40,null,289987.5,208800,162400,142100,110200,null,181162.5,130812.5,101300,87937.5,68387.5]
[41,null,294750,212225,165062.5,144425,112000,null,184012.5,132825,102850,89287.5,69425]
[42,null,299587.5,215700,167775,146800,113850,null,186887.5,134937.5,104475,90687.5,70537.5]
{"$rows_left_out":1551}