{"text_format":"1","workbook":"xlsx","n_sheets":10,"sheets":["Datos Asegurado","Instrucciones","Comparativo","Template PDF","Template PDF Comparativo","Brochure","Versión","Objetos Estructura","Master","MasterBase"],"not_rendered":{"charts":0,"images":16,"macros":1,"external_links":0,"defined_names":6,"comments":0,"pivot_tables":0},"unopened":[],"bounds":{"document_bytes":16777216,"sheet_cells":100000,"rows_first":2000,"rows_last":500,"rows_between":2000,"halvings":0,"cell_chars":16384,"cell_head_chars":4096},"cells_cut":0,"cells_raw":0,"read":"whole","date_system":"1900"}

{"sheet":"Datos Asegurado","index":0,"n_rows":49,"n_cols":16,"rows_kept":49,"cut":false,"hidden":false,"merged":[[1,7,2,13],[3,10,3,12],[23,2,23,3],[1,0,2,5],[36,0,36,1],[36,10,36,12],[11,4,12,5],[10,2,10,3]]}
[]
["   Cotización",null,null,null,null,null,null,"   Integrantes adicionales a cotizar"]
[]
["   1. Ingrese los datos del asegurado",null,null,null,null,null,null,null,null,null,"Fecha de Nacimiento"]
[null,null,null,null,null,null,null,"Número ","Relación","Género","Día","Mes","Año","Edad"]
[null,"Fecha Cotización:",{"$f":"TODAY()","v":"2022-07-20"}]
[null,"Nombre del titular:"]
[null,"Edad del titular:"]
[null,"Género:"]
[]
[null,"Zona:","Zona 1: CDMX, Area Metropolitana y Monterrey"]
[]
[null,"Número de integrantes adicionales a cotizar:"]
[]
[]
["   2. Datos del agente"]
[]
[null,"Nombre del agente:","Edith Gonzalez Herrera"]
[null,"Agencia:","Oficina Regional Puebla"]
[]
{"$rows_left_out":30}
{"sheet":"Instrucciones","index":1,"n_rows":0,"n_cols":0,"rows_kept":0,"cut":false,"hidden":false,"merged":[]}

{"sheet":"Comparativo","index":2,"n_rows":62,"n_cols":15,"rows_kept":62,"cut":false,"hidden":false,"merged":[]}
[]
[null,"   Datos de usuario"]
[]
[null,null,"Fecha Cotización:","2022-07-07"]
[null,null,"Nombre del titular:","ERIC MANZO SAIZ"]
[null,null,"Edad del titular:",48]
[null,null,"Género:","Masculino"]
[]
[null,null,"Zona:","Zona 2: Republica mexicana, excepto CDMX, Area Metropolitana y Monterrey"]
[]
[null,null,"Número de integrantes adicionales a cotizar:",8]
[]
[]
[]
[]
[null,"   Datos de póliza",null,null,null,null,null,null,"  Opción  1"]
[null,null,null,null,null,null,null,null,null,"Datos de cotización"]
[null,null,"Tipo de  cliente:","Nuevo negocio",null,null,null,null,null,"Concepto ",null,null,"Semestral","Trimestral","Mensual"]
[null,null,null,null,null,null,null,null,null,null,"Prima del asegurado titular:",28112,14688.519999999999,7555.0999999999995,2600.36]
[null,null,"Zona:",0,null,null,null,null,null,null,"Prima cónyuge:",20906,10923.384999999998,5618.4875000000002,1933.8050000000003]
{"$rows_left_out":43}
{"sheet":"Template PDF","index":3,"n_rows":51,"n_cols":6,"rows_kept":51,"cut":false,"hidden":false,"merged":[[48,1,49,5],[50,1,61,5]]}
[]
[]
[]
[]
[]
[]
[]
[]
[]
[]
[]
[]
[]
[]
[null,"Cotización"]
[]
[null,"Datos Titular"]
[null,"Nombre del titular:",{"$f":"'Datos Asegurado'!C7","v":0},"Nombre Agente:",{"$f":"'Datos Asegurado'!C18","v":"Edith Gonzalez Herrera"}]
[null,"Edad:",{"$f":"'Datos Asegurado'!C8","v":0},"Agencia:",{"$f":"'Datos Asegurado'!C19","v":"Oficina Regional Puebla"}]
[null,"Género:",{"$f":"'Datos Asegurado'!C9","v":0},{"$f":"'Datos Asegurado'!B6","v":"Fecha Cotización:"},{"$f":"'Datos Asegurado'!C6","v":"2022-07-20"}]
{"$rows_left_out":32}
{"sheet":"Template PDF Comparativo","index":4,"n_rows":76,"n_cols":6,"rows_kept":76,"cut":false,"hidden":false,"merged":[[14,1,14,5],[75,1,76,5],[77,1,77,5]]}
[]
[]
[]
[]
[]
[]
[]
[]
[]
[]
[]
[]
[]
[]
[null,"Comparativo Cotizaciones"]
[]
[null,"Nombre del titular",{"$f":"Comparativo!D5","v":"ERIC MANZO SAIZ"},{"$f":"'Datos Asegurado'!B18","v":"Nombre del agente:"},{"$f":"'Datos Asegurado'!C18","v":"Edith Gonzalez Herrera"}]
[null,"Edad",{"$f":"'Datos Asegurado'!C8","v":0},{"$f":"'Datos Asegurado'!B19","v":"Agencia:"},{"$f":"'Datos Asegurado'!C19","v":"Oficina Regional Puebla"}]
[null,"Género",{"$f":"'Datos Asegurado'!C9","v":0},{"$f":"'Datos Asegurado'!B6","v":"Fecha Cotización:"},{"$f":"'Datos Asegurado'!C6","v":"2022-07-20"}]
[null,"Lugar de residencia",{"$f":"'Datos Asegurado'!C11","v":"Zona 1: CDMX, Area Metropolitana y Monterrey"}]
{"$rows_left_out":57}
{"sheet":"Brochure","index":5,"n_rows":0,"n_cols":0,"rows_kept":0,"cut":false,"hidden":false,"merged":[]}

{"sheet":"Versión","index":6,"n_rows":3,"n_cols":3,"rows_kept":3,"cut":false,"hidden":false,"merged":[[1,0,1,1]]}
[]
["V.23"]
["Actualización: ","2022-07-20","(A.Ext)"]

{"sheet":"Objetos Estructura","index":7,"n_rows":4,"n_cols":6,"rows_kept":4,"cut":false,"hidden":true,"merged":[]}
["Estructuras Maestras"]
[]
["Estructura asegurado"]
[null,"Seleccione una opción","Masculino","10","06",1980]

{"sheet":"Master","index":8,"n_rows":87,"n_cols":41,"rows_kept":87,"cut":false,"hidden":true,"merged":[[0,17,0,18],[1,21,1,22],[0,28,0,29],[0,30,0,31],[0,32,0,33]]}
["Datos Maestros",null,null,null,null,null,null,null,null,null,null,null,null,null,null,null,null,"Prima Base",null,null,null,null,null,null,null,null,null,null,"Prima Riesgo Nuevo NN Eliminacion periodos de espera",null,"Prima Tarifa Nuevo Producto NN Eliminacion periodos de espera",null,"Prima Tarifa Nuevo Producto Ren Eliminacion periodos de espera",null,"Tarifa Base, elimación","Aceptación Periodos de Espera","Bupa Internacional",null,"Aplica descuento nuevo negocio","Asistencia en el extranjero","Aplica descuento por pago fraccionado"]
["Genero","Lugares de residencia","Zona","FD Zona","Parentezco","Dias","Meses","Años","Tipo Cliente","Factor descuento","Sumas aseguradas","FD Suma asegurada","Deducibles","Maternidad Aplica","FD Deducible","Coasegurado","FD Coasegurado","Edad",40000,"Factor es mujer","Administración","Factor descuento",null,"Recargos","NN","Renovacion","Transfer","Seguro dental","Edad","Valor","Edad","Valor","Edad","Valor","Valor","Valor","Valor",null,"Si","Si","Si"]
["Masculino","Zona 1: CDMX, Area Metropolitana y Monterrey","Zona 1",0.8,"Seleccione una opción","01","01",1946,"Nuevo negocio",1,1000000,0.87261999999999995,0,"Si",1,0,1,0,16257.969000000003,2600,1500,"Tipo cliente",{"$f":"VLOOKUP('Datos Asegurado'!C24,Master!I3:J5,2,FALSE)","v":1},"Administracion",0.15,0.15,0.15,400,{"$f":"R3","v":0},{"$f":"S3*$W$14+$AB$3","v":{"$error":"#N/A"}},{"$f":"AC3","v":0},{"$f":"AD3/(1-SUM($Y$3:$Y$5))","v":{"$error":"#N/A"}},{"$f":"AE3","v":0},{"$f":"AD3/(1-SUM($Z$3:$Z$5))","v":{"$error":"#N/A"}},{"$f":"AF3","v":{"$error":"#N/A"}},{"$f":"AI3*90%","v":{"$error":"#N/A"}},{"$f":"AI3","v":{"$error":"#N/A"}},null,"No","No","No"]
["Femenino","Zona 2: Republica mexicana, excepto CDMX, Area Metropolitana y Monterrey","Zona 2",1,"Conyuge","02","02",1947,null,null,2000000,null,null,null,null,null,null,1,14413.027840764884,null,null,"Zona",{"$f":"VLOOKUP('Datos Asegurado'!C11,Master!B3:D35,3,FALSE)","v":0.8},"Adquisicion",0.2,0.17,0.09,null,1,{"$f":"S4*$W$14+$AB$3","v":{"$error":"#N/A"}},{"$f":"AC4","v":1},{"$f":"AD4/(1-SUM($Y$3:$Y$5))","v":{"$error":"#N/A"}},{"$f":"AE4","v":1},{"$f":"AD4/(1-SUM($Z$3:$Z$5))","v":{"$error":"#N/A"}},{"$f":"AF4","v":{"$error":"#N/A"}},{"$f":"AI4*90%","v":{"$error":"#N/A"}},{"$f":"AI4","v":{"$error":"#N/A"}}]
[null,null,null,1,"Hij@","03","03",1948,null,null,3000000,null,null,null,null,null,null,2,12422.519968606075,null,null,"Suma asegurada",{"$f":"VLOOKUP('Datos Asegurado'!C27,Master!K3:L6,2,FALSE)","v":{"$error":"#N/A"}},"Utilidad",0.04,0.04,0.04,null,2,{"$error":"#N/A"},2,{"$error":"#N/A"},2,{"$error":"#N/A"},{"$error":"#N/A"},{"$error":"#N/A"},{"$error":"#N/A"}]
[null,null,null,0.8,"Dependiente economico","04","04",1949,null,null,4000000,null,null,null,null,null,null,3,11563.463583180401,null,null,"Deducible",{"$f":"VLOOKUP('Datos Asegurado'!C29,Master!M3:O11,3,FALSE)","v":1},"Total",{"$f":"SUM(Y3:Y5)","v":0.38999999999999996},{"$f":"SUM(Z3:Z5)","v":0.36},{"$f":"SUM(AA3:AA5)","v":0.27999999999999997},null,3,{"$error":"#N/A"},3,{"$error":"#N/A"},3,{"$error":"#N/A"},{"$error":"#N/A"},{"$error":"#N/A"},{"$error":"#N/A"}]
[null,null,null,0.8,null,"05","05",1950,null,null,5000000,null,null,null,null,null,null,4,10630.927064436317,null,null,"Coasegurado",{"$f":"VLOOKUP('Datos Asegurado'!C31,Master!P3:Q7,2,FALSE)","v":1},"1-Total",{"$f":"1-Y6","v":0.6100000000000001},{"$f":"1-Z6","v":0.64},{"$f":"1-AA6","v":0.72},null,4,{"$error":"#N/A"},4,{"$error":"#N/A"},4,{"$error":"#N/A"},{"$error":"#N/A"},{"$error":"#N/A"},{"$error":"#N/A"}]
[null,null,null,0.8,null,"06","06",1951,null,null,null,null,null,null,null,null,null,5,10995.294412953532,null,null,"Cobertura Extranjero: (no)",0.85492999999999997,null,null,null,null,null,5,{"$error":"#N/A"},5,{"$error":"#N/A"},5,{"$error":"#N/A"},{"$error":"#N/A"},{"$error":"#N/A"},{"$error":"#N/A"}]
[null,null,null,0.8,null,"07","07",1952,null,null,null,null,null,null,null,null,null,6,11372.150189230695,null,null,"Reducción Honorarios: (Reducido)",0.9,null,null,null,null,null,6,{"$error":"#N/A"},6,{"$error":"#N/A"},6,{"$error":"#N/A"},{"$error":"#N/A"},{"$error":"#N/A"},{"$error":"#N/A"}]
[null,null,null,0.8,null,"08","08",1953,null,null,null,null,null,null,null,null,null,7,11761.922425111356,null,null,"Copago Medicamentos: (0)",1,null,null,null,null,null,7,{"$error":"#N/A"},7,{"$error":"#N/A"},7,{"$error":"#N/A"},{"$error":"#N/A"},{"$error":"#N/A"},{"$error":"#N/A"}]
[null,null,null,1,null,"09","09",1954,null,null,null,null,null,null,null,null,null,8,12165.053822921418,null,null,"Reduccion a Consultas: (25)",0.98,null,null,null,null,null,8,{"$error":"#N/A"},8,{"$error":"#N/A"},8,{"$error":"#N/A"},{"$error":"#N/A"},{"$error":"#N/A"},{"$error":"#N/A"}]
[null,null,null,0.8,null,"10","10",1955,null,null,null,null,null,null,null,null,null,9,12582.002258289331,null,null,"Re. Renuncia utilidad: (Si)",0.95,null,null,null,null,null,9,{"$error":"#N/A"},9,{"$error":"#N/A"},9,{"$error":"#N/A"},{"$error":"#N/A"},{"$error":"#N/A"},{"$error":"#N/A"}]
[null,null,null,0.8,null,"11","11",1956,null,null,null,null,null,null,null,null,null,10,13013.241300200078,null,null,"Re. Adicional Actuarial: (Si)",0.95,null,null,null,null,null,10,{"$error":"#N/A"},10,{"$error":"#N/A"},10,{"$error":"#N/A"},{"$error":"#N/A"},{"$error":"#N/A"},{"$error":"#N/A"}]
[null,null,null,0.8,null,"12","12",1957,null,null,null,null,null,null,null,null,null,11,13459.260748873632,null,null,"Factor descuento sin tipo cliente",{"$f":"W5*W6*W7*W8*W9*W10*W11*W12*W13*W4","v":{"$error":"#N/A"}},null,null,null,null,null,11,{"$error":"#N/A"},11,{"$error":"#N/A"},11,{"$error":"#N/A"},{"$error":"#N/A"},{"$error":"#N/A"},{"$error":"#N/A"}]
[null,null,null,0.8,null,"13",null,1958,null,null,null,null,null,null,null,null,null,12,13920.567192078823,null,null,"Factor descuento con tipo cliente",{"$f":"W3*W4*W5*W6*W7*W8*W9*W10*W11*W12*W13","v":{"$error":"#N/A"}},null,null,null,null,null,12,{"$error":"#N/A"},12,{"$error":"#N/A"},12,{"$error":"#N/A"},{"$error":"#N/A"},{"$error":"#N/A"},{"$error":"#N/A"}]
[null,null,null,0.8,null,"14",null,1959,null,null,null,null,null,null,null,null,null,13,14397.684580514455,null,null,null,null,null,null,null,null,null,13,{"$error":"#N/A"},13,{"$error":"#N/A"},13,{"$error":"#N/A"},{"$error":"#N/A"},{"$error":"#N/A"},{"$error":"#N/A"}]
[null,null,null,1,null,"15",null,1960,null,null,null,null,null,null,null,null,null,14,14891.15482291118,null,null,null,null,null,null,null,null,null,14,{"$error":"#N/A"},14,{"$error":"#N/A"},14,{"$error":"#N/A"},{"$error":"#N/A"},{"$error":"#N/A"},{"$error":"#N/A"}]
[null,null,null,0.8,null,"16",null,1961,null,null,null,null,null,null,null,null,null,15,15401.538401530081,null,null,null,null,null,null,null,null,null,15,{"$error":"#N/A"},15,{"$error":"#N/A"},15,{"$error":"#N/A"},{"$error":"#N/A"},{"$error":"#N/A"},{"$error":"#N/A"}]
[null,null,null,0.8,null,"17",null,1962,null,null,null,null,null,null,null,null,null,16,15929.415008757012,null,null,null,null,null,null,null,null,null,16,{"$error":"#N/A"},16,{"$error":"#N/A"},16,{"$error":"#N/A"},{"$error":"#N/A"},{"$error":"#N/A"},{"$error":"#N/A"}]
[null,null,null,0.8,null,"18",null,1963,null,null,null,null,null,null,null,null,null,17,16475.384205515762,null,null,null,null,null,null,null,null,null,17,{"$error":"#N/A"},17,{"$error":"#N/A"},17,{"$error":"#N/A"},{"$error":"#N/A"},{"$error":"#N/A"},{"$error":"#N/A"}]
{"$rows_left_out":68}
{"sheet":"MasterBase","index":9,"n_rows":852,"n_cols":17,"rows_kept":852,"cut":false,"hidden":true,"merged":[[0,12,0,16]]}
["Producto Seleccionado",null,null,null,null,null,null,null,null,null,null,null,"Tarifas base"]
["Contrucción del plan seleccionado",null,null,null,null,null,null,null,null,null,null,null,"Llave de busqueda","PlanName","Region","LowAge","Rate"]
["Suma asegurada","Deducible","Coaseguro","Tipo de cliente","Código de producto",null,null,null,null,null,null,null,{"$f":"CONCATENATE(N3,O3,P3)","v":"NVFS1D0C0TC0Mexico Region 1 BNV0"},"NVFS1D0C0TC0","Mexico Region 1 BNV",0,9754]
[{"$f":"'Datos Asegurado'!C27/1000000","v":0},{"$f":"'Datos Asegurado'!C29/1000","v":0},{"$f":"'Datos Asegurado'!C31*100","v":0},0,{"$f":"CONCATENATE(\"NVFS\",A4,\"D\",B4,\"C\",C4,\"TC\",D4)","v":"NVFS0D0C0TC0"},null,null,null,null,null,null,null,"NVFS1D0C0TC0Mexico Region 1 BNV1","NVFS1D0C0TC0","Mexico Region 1 BNV",1,8696]
[null,null,null,null,null,null,null,null,null,null,null,null,"NVFS1D0C0TC0Mexico Region 1 BNV2","NVFS1D0C0TC0","Mexico Region 1 BNV",2,7556]
["Región seleccionada",null,null,null,null,null,null,null,null,null,null,null,"NVFS1D0C0TC0Mexico Region 1 BNV3","NVFS1D0C0TC0","Mexico Region 1 BNV",3,7065]
[{"$f":"IF('Datos Asegurado'!C11=\"Zona 1: CDMX, Area Metropolitana y Monterrey\",\"Mexico Region 1 BNV\",\"Mexico Region 2 (no CDMX, ZM y MTY)\")","v":"Mexico Region 1 BNV"},null,null,null,null,null,null,null,null,null,null,null,"NVFS1D0C0TC0Mexico Region 1 BNV4","NVFS1D0C0TC0","Mexico Region 1 BNV",4,6530]
[null,null,null,null,null,null,null,null,null,null,null,null,"NVFS1D0C0TC0Mexico Region 1 BNV5","NVFS1D0C0TC0","Mexico Region 1 BNV",5,6739]
["Edad titular","Sexo titular","Valor prima",null,null,null,null,null,null,null,null,null,"NVFS1D0C0TC0Mexico Region 1 BNV6","NVFS1D0C0TC0","Mexico Region 1 BNV",6,6954]
[{"$f":"'Datos Asegurado'!C8","v":0},{"$f":"IF('Datos Asegurado'!C9=\"Masculino\",\"Male\",\"Female\")","v":"Female"},{"$f":"IFERROR(VLOOKUP(CONCATENATE($E$4,$A$7,A10),$M$3:$Q$851,5,FALSE),0)","v":0},null,null,null,null,null,null,null,null,null,"NVFS1D0C0TC0Mexico Region 1 BNV7","NVFS1D0C0TC0","Mexico Region 1 BNV",7,7179]
[null,null,null,null,null,null,null,null,null,null,null,null,"NVFS1D0C0TC0Mexico Region 1 BNV8","NVFS1D0C0TC0","Mexico Region 1 BNV",8,7409]
[null,null,null,null,null,null,null,null,null,null,null,null,"NVFS1D0C0TC0Mexico Region 1 BNV9","NVFS1D0C0TC0","Mexico Region 1 BNV",9,7647]
["Conyuges",null,null,null,"Hijos",null,null,null,"Dependientes",null,null,null,"NVFS1D0C0TC0Mexico Region 1 BNV10","NVFS1D0C0TC0","Mexico Region 1 BNV",10,7895]
["Econyugues","S Conyugues","Valor prima",null,"E hijos","S Hijos","Valor prima",null,"E dependientes","S dependientes","Valor prima",null,"NVFS1D0C0TC0Mexico Region 1 BNV11","NVFS1D0C0TC0","Mexico Region 1 BNV",11,8151]
[{"$f":"IF('Datos Asegurado'!I6=\"Conyuge\",'Datos Asegurado'!N6,\"\")","v":""},{"$f":"IF('Datos Asegurado'!I6=\"Conyuge\",IF('Datos Asegurado'!J6=\"Masculino\",\"Male\",\"Female\"),\"\")","v":""},{"$f":"IFERROR(VLOOKUP(CONCATENATE($E$4,$A$7,A15),$M$3:$Q$852,5,FALSE),0)","v":0},null,{"$f":"IF('Datos Asegurado'!I6=\"Hij@\",'Datos Asegurado'!N6,\"\")","v":""},{"$f":"IF('Datos Asegurado'!I6=\"Hij@\",IF('Datos Asegurado'!J6=\"Masculino\",\"Male\",\"Female\"),\"\")","v":""},{"$f":"IFERROR(VLOOKUP(CONCATENATE($E$4,$A$7,E15),$M$3:$Q$852,5,FALSE),0)","v":0},null,{"$f":"IF('Datos Asegurado'!I6=\"Dependiente economico\",'Datos Asegurado'!N6,\"\")","v":""},{"$f":"IF('Datos Asegurado'!I6=\"Dependiente economico\",IF('Datos Asegurado'!J6=\"Masculino\",\"Male\",\"Female\"),\"\")","v":""},{"$f":"IFERROR(VLOOKUP(CONCATENATE($E$4,$A$7,I15),$M$3:$Q$852,5,FALSE),0)","v":0},null,"NVFS1D0C0TC0Mexico Region 1 BNV12","NVFS1D0C0TC0","Mexico Region 1 BNV",12,8414]
[{"$f":"IF('Datos Asegurado'!I7=\"Conyuge\",'Datos Asegurado'!N7,\"\")","v":""},{"$f":"IF('Datos Asegurado'!I7=\"Conyuge\",IF('Datos Asegurado'!J7=\"Masculino\",\"Male\",\"Female\"),\"\")","v":""},0,null,{"$f":"IF('Datos Asegurado'!I7=\"Hij@\",'Datos Asegurado'!N7,\"\")","v":""},{"$f":"IF('Datos Asegurado'!I7=\"Hij@\",IF('Datos Asegurado'!J7=\"Masculino\",\"Male\",\"Female\"),\"\")","v":""},0,null,{"$f":"IF('Datos Asegurado'!I7=\"Dependiente economico\",'Datos Asegurado'!N7,\"\")","v":""},{"$f":"IF('Datos Asegurado'!I7=\"Dependiente economico\",IF('Datos Asegurado'!J7=\"Masculino\",\"Male\",\"Female\"),\"\")","v":""},0,null,"NVFS1D0C0TC0Mexico Region 1 BNV13","NVFS1D0C0TC0","Mexico Region 1 BNV",13,8688]
[{"$f":"IF('Datos Asegurado'!I8=\"Conyuge\",'Datos Asegurado'!N8,\"\")","v":""},{"$f":"IF('Datos Asegurado'!I8=\"Conyuge\",IF('Datos Asegurado'!J8=\"Masculino\",\"Male\",\"Female\"),\"\")","v":""},0,null,{"$f":"IF('Datos Asegurado'!I8=\"Hij@\",'Datos Asegurado'!N8,\"\")","v":""},{"$f":"IF('Datos Asegurado'!I8=\"Hij@\",IF('Datos Asegurado'!J8=\"Masculino\",\"Male\",\"Female\"),\"\")","v":""},0,null,{"$f":"IF('Datos Asegurado'!I8=\"Dependiente economico\",'Datos Asegurado'!N8,\"\")","v":""},{"$f":"IF('Datos Asegurado'!I8=\"Dependiente economico\",IF('Datos Asegurado'!J8=\"Masculino\",\"Male\",\"Female\"),\"\")","v":""},0,null,"NVFS1D0C0TC0Mexico Region 1 BNV14","NVFS1D0C0TC0","Mexico Region 1 BNV",14,8970]
[{"$f":"IF('Datos Asegurado'!I9=\"Conyuge\",'Datos Asegurado'!N9,\"\")","v":""},{"$f":"IF('Datos Asegurado'!I9=\"Conyuge\",IF('Datos Asegurado'!J9=\"Masculino\",\"Male\",\"Female\"),\"\")","v":""},0,null,{"$f":"IF('Datos Asegurado'!I9=\"Hij@\",'Datos Asegurado'!N9,\"\")","v":""},{"$f":"IF('Datos Asegurado'!I9=\"Hij@\",IF('Datos Asegurado'!J9=\"Masculino\",\"Male\",\"Female\"),\"\")","v":""},0,null,{"$f":"IF('Datos Asegurado'!I9=\"Dependiente economico\",'Datos Asegurado'!N9,\"\")","v":""},{"$f":"IF('Datos Asegurado'!I9=\"Dependiente economico\",IF('Datos Asegurado'!J9=\"Masculino\",\"Male\",\"Female\"),\"\")","v":""},0,null,"NVFS1D0C0TC0Mexico Region 1 BNV15","NVFS1D0C0TC0","Mexico Region 1 BNV",15,9263]
[{"$f":"IF('Datos Asegurado'!I10=\"Conyuge\",'Datos Asegurado'!N10,\"\")","v":""},{"$f":"IF('Datos Asegurado'!I10=\"Conyuge\",IF('Datos Asegurado'!J10=\"Masculino\",\"Male\",\"Female\"),\"\")","v":""},0,null,{"$f":"IF('Datos Asegurado'!I10=\"Hij@\",'Datos Asegurado'!N10,\"\")","v":""},{"$f":"IF('Datos Asegurado'!I10=\"Hij@\",IF('Datos Asegurado'!J10=\"Masculino\",\"Male\",\"Female\"),\"\")","v":""},0,null,{"$f":"IF('Datos Asegurado'!I10=\"Dependiente economico\",'Datos Asegurado'!N10,\"\")","v":""},{"$f":"IF('Datos Asegurado'!I10=\"Dependiente economico\",IF('Datos Asegurado'!J10=\"Masculino\",\"Male\",\"Female\"),\"\")","v":""},0,null,"NVFS1D0C0TC0Mexico Region 1 BNV16","NVFS1D0C0TC0","Mexico Region 1 BNV",16,9565]
[{"$f":"IF('Datos Asegurado'!I11=\"Conyuge\",'Datos Asegurado'!N11,\"\")","v":""},{"$f":"IF('Datos Asegurado'!I11=\"Conyuge\",IF('Datos Asegurado'!J11=\"Masculino\",\"Male\",\"Female\"),\"\")","v":""},0,null,{"$f":"IF('Datos Asegurado'!I11=\"Hij@\",'Datos Asegurado'!N11,\"\")","v":""},{"$f":"IF('Datos Asegurado'!I11=\"Hij@\",IF('Datos Asegurado'!J11=\"Masculino\",\"Male\",\"Female\"),\"\")","v":""},0,null,{"$f":"IF('Datos Asegurado'!I11=\"Dependiente economico\",'Datos Asegurado'!N11,\"\")","v":""},{"$f":"IF('Datos Asegurado'!I11=\"Dependiente economico\",IF('Datos Asegurado'!J11=\"Masculino\",\"Male\",\"Female\"),\"\")","v":""},0,null,"NVFS1D0C0TC0Mexico Region 1 BNV17","NVFS1D0C0TC0","Mexico Region 1 BNV",17,9879]
{"$rows_left_out":832}