{"text_format":"1","workbook":"xlsx","n_sheets":7,"sheets":["Instrucciones","Datos Asegurado","máster","Brochure","Template PDF","Objetos Estructura","Master"],"not_rendered":{"charts":0,"images":15,"macros":1,"external_links":0,"defined_names":3,"comments":1,"pivot_tables":0},"unopened":[],"bounds":{"document_bytes":16777216,"sheet_cells":100000,"rows_first":2000,"rows_last":500,"rows_between":2000,"halvings":0,"cell_chars":16384,"cell_head_chars":4096},"cells_cut":0,"cells_raw":0,"read":"whole","date_system":"1900"}

{"sheet":"Instrucciones","index":0,"n_rows":65,"n_cols":2,"rows_kept":65,"cut":false,"hidden":false,"merged":[]}
[]
[null,"     Ingresa tus datos "]
[]
[]
[]
[]
[]
[]
[]
[]
[]
[]
[]
[]
[]
[]
[]
[]
[]
[null,"     Si requieres cotizar a más integrantes de la póliza , selecciona primero el número de integrantes aquí"]
[]
[]
[]
[]
[]
[]
[]
[]
[]
[]
{"$rows_left_out":36}
{"sheet":"Datos Asegurado","index":1,"n_rows":43,"n_cols":11,"rows_kept":43,"cut":false,"hidden":false,"merged":[[30,7,30,10],[31,0,42,0],[1,7,2,10],[1,0,2,5],[15,2,15,3],[16,2,16,3],[28,1,28,4]]}
[]
["   Cotización",null,null,null,null,null,null,"   2. Integrantes adicionales a cotizar"]
[]
["   1. Ingrese los datos del asegurado"]
[null,null,null,null,null,null,null,"Número ","Relación","Género","Edad"]
[null,"Fecha Cotización:",{"$f":"TODAY()","v":"2022-01-19"}]
[null,"Nombre del titular:","Usuario"]
[null,"Edad del titular:",45]
[null,"Género:","Femenino"]
[]
[null,"Número de integrantes adicionales a cotizar:",0]
[]
[]
["   3. Datos del agente"]
[]
[null,"Nombre del agente:","Maria"]
[null,"Agencia:","Bupa Mex"]
[]
[]
["   4. Datos de la póliza"]
[null,null,null,null,"$ 1,000,000 MNX"]
["Tipo de  cliente:","Nuevo negocio ",null,null,"$ 2,000,000 MNX"]
[null,null,null,null,"$ 3,000,000 MNX"]
[null,null,"Asistencia en el extranjero:","No","$ 5,000,000 MNX"]
[null,null,"Deducible:",10000]
["Suma asegurada (mxn):","$ 1,000,000 MNX","Coaseguro:",0.2]
[null,null,"Zona:","Zona 1: CDMX, Area Metropolitana y Monterrey"]
[]
[null,"Te recordamos que contamos con la promoción de eliminación el deducible y coaseguro de por vida del Plan Bupa Nacional Vital para contrataciones desde el 18 de enero hasta el 30 de junio del 2022."]
[{"$f":"+B26","v":"$ 1,000,000 MNX"},{"$f":"VLOOKUP($A$30,máster!$F$78:$G$81,2,0)","v":"1M"}]
{"$rows_left_out":14}
{"sheet":"máster","index":2,"n_rows":349,"n_cols":29,"rows_kept":349,"cut":false,"hidden":true,"merged":[[42,33,45,33],[0,0,0,1],[1,0,1,1],[42,30,45,30],[42,31,45,31],[42,32,45,32]]}
["Bupa Nacional Vital Individual"]
["Prima en Pesos Mexicanos",null,null,null,null,null,null,null,null,null,null,null,null,null,null,null,null,null,null,null,null,null,null,null,"Zonas",null,null,"Coaseguro","Deducible"]
[null,"Z1","Z2",null,null,null,null,null,null,null,null,null,null,null,null,null,null,null,null,null,null,null,null,null,"Zona 1: CDMX, Area Metropolitana y Monterrey",{"$f":"IF('Datos Asegurado'!D25=0,4,2)","v":2},null,0.2,10000]
["Deducible",10000,10000,0,null,null,null,null,null,null,null,null,null,null,null,null,null,null,null,null,null,null,null,null,"Zona 2: Republica mexicana, excepto CDMX, Area Metropolitana y Monterrey",{"$f":"IF('Datos Asegurado'!D25=0,4,3)","v":3}]
["Coaseguro",20,20,0]
["Edad","Prima de Tarifa","Prima de tarifa","Prima de tarifa",null,null,null,{"$f":"+'Datos Asegurado'!B30","v":"1M"},"% de recargo ",0,4.4999999999999998E-2,7.4999999999999997E-2,0.11]
["01M",9814,9814,12919.616019833338,null,"Concepto","Edad","Patrón de edad","Prima (desde base) ","Anual ","Semestral ","Trimestral ","Mensual ",null,null,null,null,null,"Familia "]
["11M",8750,8750,11515.039327696741,null,"Prima del asegurado (títular) ",{"$f":"+'Datos Asegurado'!C8","v":45},{"$f":"CONCATENATE(G8,$H$6)","v":"451M"},{"$f":"VLOOKUP(H8,$A$7:$D$349,(VLOOKUP('Datos Asegurado'!D27,máster!Y3:Z4,2,0)),0)+J56","v":23781},{"$f":"$I$8*J6+$I$8+máster!O20","v":23781},{"$f":"$I$8*K6+$I$8+(250)","v":25101.145},{"$f":"$I$8*L6+$I$8+(250)","v":25814.575000000001},{"$f":"$I$8*M6+$I$8+(250)","v":26646.91},null,null,null,null,null,34,{"$f":"+B299","v":23631},0.11700000000000001]
["21M",7603,7603,9999.9244809787651,1,{"$f":"+'Datos Asegurado'!I6","v":0},{"$f":"+'Datos Asegurado'!K6","v":0},"01M",{"$f":"VLOOKUP(H9,$A$7:$D$349,(VLOOKUP('Datos Asegurado'!D27,máster!Y3:Z4,2,0)),0)+J56","v":9814},{"$f":"+$I$9*J6+$I$9","v":9814},{"$f":"+$I$9*K6+$I$9","v":10255.629999999999},10550.05,{"$f":"+$I$9*M6+$I$9","v":10893.54},null,null,null,null,null,46,{"$f":"+B311","v":32661},7.4999999999999997E-2]
["31M",7108,7108,9346.0698139496581,2,{"$f":"+'Datos Asegurado'!I7","v":0},{"$f":"+'Datos Asegurado'!K7","v":0},"01M",{"$f":"VLOOKUP(H10,$A$7:$D$349,(VLOOKUP('Datos Asegurado'!D27,máster!Y3:Z4,2,0)),0)","v":9814},{"$f":"+$I$10*J6+$I$10","v":9814},{"$f":"+$I$10*K6+$I$10","v":10255.629999999999},10550.05,{"$f":"+$I$10*M6+$I$10","v":10893.54},null,null,null,null,null,10,{"$f":"+B275","v":10464},4.4999999999999998E-2]
["41M",6571,6571,8636.3601783511622,3,{"$f":"+'Datos Asegurado'!I8","v":0},{"$f":"+'Datos Asegurado'!K8","v":0},"01M",{"$f":"VLOOKUP(H11,$A$7:$D$349,(VLOOKUP('Datos Asegurado'!D27,máster!Y3:Z4,2,0)),0)+J56","v":9814},{"$f":"+$I$11*J6+$I$11","v":9814},{"$f":"+$I$11*K6+$I$11","v":10255.629999999999},10550.05,{"$f":"+$I$11*M6+$I$11","v":10893.54},null,null,null,null,null,5,{"$f":"+B270","v":8926},0]
["51M",6780,6780,8913.2914560833215,4,{"$f":"+'Datos Asegurado'!I9","v":0},{"$f":"+'Datos Asegurado'!K9","v":0},"01M",{"$f":"VLOOKUP(H12,$A$7:$D$349,(VLOOKUP('Datos Asegurado'!D27,máster!Y3:Z4,2,0)),0)+J56","v":9814},{"$f":"+$I$12*J6+$I$12","v":9814},{"$f":"+$I$12*K6+$I$12","v":10255.629999999999},10550.05,10893.54,null,null,null,null,null,"TOTAL ",{"$f":"SUM(T8:T11)","v":75682}]
["61M",6998,6998,9200.3781826462819,5,{"$f":"+'Datos Asegurado'!I10","v":0},{"$f":"+'Datos Asegurado'!K10","v":0},"01M",{"$f":"VLOOKUP(H13,$A$7:$D$349,(VLOOKUP('Datos Asegurado'!D27,máster!Y3:Z4,2,0)),0)+J56","v":9814},{"$f":"+$I$13*J6+$I$13","v":9814},{"$f":"+$I$13*K6+$I$13","v":10255.629999999999},10550.05,{"$f":"+$I$13*M6+$I$13","v":10893.54},null,null,null,null,null,"IVA",0.16]
["71M",7223,7223,9497.2297638542368,6,{"$f":"+'Datos Asegurado'!I11","v":0},{"$f":"+'Datos Asegurado'!K11","v":0},"01M",{"$f":"VLOOKUP(H14,$A$7:$D$349,(VLOOKUP('Datos Asegurado'!D27,máster!Y3:Z4,2,0)),0)+J56","v":9814},{"$f":"+$I$14*J6+$I$14","v":9814},{"$f":"+$I$14*K6+$I$14","v":10255.629999999999},10550.05,{"$f":"+$I$14*M6+$I$14","v":10893.54},null,null,null,null,null,null,{"$f":"+T12*T13","v":12109.12}]
["81M",7455,7455,9803.8461997071918,7,{"$f":"+'Datos Asegurado'!I12","v":0},{"$f":"+'Datos Asegurado'!K12","v":0},"01M",{"$f":"VLOOKUP(H15,$A$7:$D$349,(VLOOKUP('Datos Asegurado'!D27,máster!Y3:Z4,2,0)),0)+J56","v":9814},{"$f":"+$I$15*J6+$I$15","v":9814},{"$f":"+$I$15*K6+$I$15","v":10255.629999999999},10550.05,10893.54,null,null,null,null,null,"derecho de poliza",500,"x poliza (pendiente de revisar)solo una vez,primer recibo "]
["91M",7695,7695,10121.399272762545,8,{"$f":"+'Datos Asegurado'!I13","v":0},{"$f":"+'Datos Asegurado'!K13","v":0},"01M",{"$f":"VLOOKUP(H16,$A$7:$D$349,(VLOOKUP('Datos Asegurado'!D27,máster!Y3:Z4,2,0)),0)+J56","v":9814},{"$f":"+$I$16*J6+$I$16","v":9814},{"$f":"+$I$16*K6+$I$16","v":10255.629999999999},10550.05,10893.54,null,null,null,null,null,"uso de la red",250,"x asegurado "]
["101M",7944,7944,10449.4983888345,9,{"$f":"+'Datos Asegurado'!I14","v":0},{"$f":"+'Datos Asegurado'!K14","v":0},"01M",{"$f":"VLOOKUP(H17,$A$7:$D$349,(VLOOKUP('Datos Asegurado'!D27,máster!Y3:Z4,2,0)),0)+J56","v":9814},{"$f":"+$I$17*J6+$I$17","v":9814},{"$f":"+$I$17*K6+$I$17","v":10255.629999999999},{"$f":"+$I$17*L6+$I$17","v":10550.05},10893.54]
["111M",8201,8201,10788.924736294648,null,null,null,null,null,null,null,null,null,null,null,null,null,null,"total ",{"$f":"+T12","v":75682}]
["121M",8467,8467,11140.068909328797,null,null,null,null,null,null,null,null,null,null,null,null,null,null,null,{"$f":"+T15","v":500},null,"recargo porpagofracccionado"]
["131M",8742,8742,11503.712096308544,null,null,null,null,null,5,6,7,8,"uso de red",0,null,null,null,null,{"$f":"+T16","v":250},null,"FORMAS DE PAGO",null,"mismos"]
["141M",9026,9026,11879.073108862289,null,"Hij@",1,null,null,{"$f":"IFERROR(VLOOKUP(F21,F9:M9,5,0),0)","v":0},{"$f":"IFERROR(VLOOKUP(F21,F9:M9,6,0),0)","v":0},{"$f":"IFERROR(VLOOKUP(F21,F9:M9,7,0),0)","v":0},{"$f":"IFERROR(VLOOKUP(F21,F9:M9,8,0),0)","v":0},"Hij@",null,null,null,null,null,{"$f":"SUM(T18:T20)","v":76432},null,"MENSUAL ",0.11700000000000001]
["151M",9320,9320,12267.323729547432,null,"Hij@",2,null,null,{"$f":"IFERROR(VLOOKUP(F22,F10:M10,5,0),0)","v":0},{"$f":"IFERROR(VLOOKUP(F22,F10:M10,6,0),0)","v":0},{"$f":"IFERROR(VLOOKUP(F22,F10:M10,7,0),0)","v":0},{"$f":"IFERROR(VLOOKUP(F22,F10:M10,8,0),0)","v":0},{"$f":"COUNTIF(F9:F17,N21)","v":0},{"$f":"(N22*$O$20)","v":0},null,null,null,0.16,{"$f":"+T21*S22","v":12229.12},null,"TRIMESTRAL ",7.4999999999999997E-2]
["161M",9624,9624,12668.854552549774,null,"Hij@",3,null,null,0,0,0,0,null,null,null,null,null,null,{"$f":"+T21+T22","v":88661.119999999995},null,"SEMESTRAL ",4.4999999999999998E-2]
["171M",9939,9939,13085.227954612512,null,"Hij@",4,null,null,0,0,0,0,null,null,null,null,null,null,null,null,"ANUAL ",0]
["181M",10226,10226,13463.909017745558,null,"Hij@",5,null,null,0,0,0,0]
["191M",10529,10529,13863.926288277924,null,"Hij@",6,null,null,0,0,0,0]
["201M",10841,10841,14275.94407692626,null,"Hij@",7,null,null,0,0,0,0]
["211M",11162,11162,14700.322399234048,null,"Hij@",8,null,null,0,0,0,0]
["221M",11493,11493,15137.432071211071,null,"Hij@",9,null,null,{"$f":"IFERROR(VLOOKUP(F29,F17:M17,5,0),0)","v":0},0,0,0]
["231M",11834,11834,15587.655033347401,null,"Total de hijos",null,null,null,{"$f":"SUM(J21:J29)","v":0},{"$f":"SUM(K21:K29)","v":0},0,0]
{"$rows_left_out":320}
{"sheet":"Brochure","index":3,"n_rows":0,"n_cols":0,"rows_kept":0,"cut":false,"hidden":false,"merged":[]}

{"sheet":"Template PDF","index":4,"n_rows":48,"n_cols":6,"rows_kept":48,"cut":false,"hidden":false,"merged":[[47,1,53,5]]}
[]
[]
[]
[]
[]
[]
[]
[]
[]
[]
[]
[]
[]
[]
[null,"Cotización"]
[]
[null,"Datos Titular"]
[null,"Nombre del titular:",{"$f":"'Datos Asegurado'!C7","v":"Usuario"},"Nombre Agente:",{"$f":"'Datos Asegurado'!C16","v":"Maria"}]
[null,"Edad:",{"$f":"'Datos Asegurado'!C8","v":45},"Agencia:",{"$f":"'Datos Asegurado'!C17","v":"Bupa Mex"}]
[null,"Género:",{"$f":"'Datos Asegurado'!C9","v":"Femenino"},{"$f":"'Datos Asegurado'!B6","v":"Fecha Cotización:"},{"$f":"'Datos Asegurado'!C6","v":"2022-01-19"}]
[null,"Zona residencia:",{"$f":"'Datos Asegurado'!D27","v":"Zona 1: CDMX, Area Metropolitana y Monterrey"}]
[null,"Número de integrantes a cotizar:",{"$f":"'Datos Asegurado'!C11","v":0}]
[]
[null,"Características de la Póliza"]
[]
[null,"Suma asegurada (mxn):",{"$f":"'Datos Asegurado'!B26","v":"$ 1,000,000 MNX"}]
[null,"Deducible (mxn):",{"$f":"'Datos Asegurado'!D25","v":10000}]
[null,"Coaseguro",{"$f":"'Datos Asegurado'!D26","v":0.2}]
[null,"Tipo de cliente:",{"$f":"+'Datos Asegurado'!B22","v":"Nuevo negocio "}]
[null,"Asistencia en el extranjero: ",{"$f":"'Datos Asegurado'!D24","v":"No"}]
{"$rows_left_out":19}
{"sheet":"Objetos Estructura","index":5,"n_rows":4,"n_cols":4,"rows_kept":4,"cut":false,"hidden":true,"merged":[]}
["Estructuras Maestras"]
[]
["Estructura asegurado"]
[null,"Seleccione una opción","Masculino",18]

{"sheet":"Master","index":6,"n_rows":87,"n_cols":41,"rows_kept":87,"cut":false,"hidden":true,"merged":[[0,17,0,18],[1,21,1,22],[0,28,0,29],[0,30,0,31],[0,32,0,33]]}
["Datos Maestros",null,null,null,null,null,null,null,null,null,null,null,null,null,null,null,null,"Prima Base",null,null,null,null,null,null,null,null,null,null,"Prima Riesgo Nuevo NN Eliminacion periodos de espera",null,"Prima Tarifa Nuevo Producto NN Eliminacion periodos de espera",null,"Prima Tarifa Nuevo Producto Ren Eliminacion periodos de espera",null,"Tarifa Base, elimación","Aceptación Periodos de Espera","Bupa Internacional",null,"Descuento nuevo negocio","Asistencia en el extranjero","Asistencia Extranjero Valor"]
["Genero","Lugares de residencia","Zona","FD Zona","Parentezco","Dias","Meses","Años","Tipo Cliente","Factor descuento","Sumas aseguradas","FD Suma asegurada","Deducibles","Maternidad Aplica","FD Deducible","Coasegurado","FD Coasegurado","Edad",40000,"Factor es mujer","Administración","Factor descuento",null,"Recargos","NN","Renovacion","Transfer","Seguro dental","Edad","Valor","Edad","Valor","Edad","Valor","Valor","Valor","Valor",null,"Si","Si",1632]
["Masculino","Aguascalientes","Zona 2",0.8,"Seleccione una opción","01","01",1946,"Nuevo negocio - con periodos de espera",0.89,5000000,0.87261999999999995,9000,"Si",1.1146,0,1,0,16257.969000000003,2600,1500,"Tipo cliente",{"$f":"VLOOKUP('Datos Asegurado'!#REF!,Master!I3:J5,2,FALSE)","v":{"$error":"#REF!"}},"Administracion",0.15,0.15,0.15,400,{"$f":"R3","v":0},{"$f":"S3*$W$14+$AB$3","v":{"$error":"#REF!"}},{"$f":"AC3","v":0},{"$f":"AD3/(1-SUM($Y$3:$Y$5))","v":{"$error":"#REF!"}},{"$f":"AE3","v":0},{"$f":"AD3/(1-SUM($Z$3:$Z$5))","v":{"$error":"#REF!"}},{"$f":"AF3","v":{"$error":"#REF!"}},{"$f":"AI3*90%","v":{"$error":"#REF!"}},{"$f":"AI3","v":{"$error":"#REF!"}},null,"No","No"]
["Femenino","Baja California Norte","Zona 1",1,"Cónyuge","02","02",1947,"Nuevo negocio - reconocimiento de antigüedad",0.95,10000000,0.91164999999999996,17000,"Si",1.0789200000000001,0.1,0.94257000000000002,1,14413.027840764884,null,null,"Zona",{"$f":"VLOOKUP('Datos Asegurado'!#REF!,Master!B3:D35,3,FALSE)","v":{"$error":"#REF!"}},"Adquisicion",0.2,0.17,0.09,null,1,{"$f":"S4*$W$14+$AB$3","v":{"$error":"#REF!"}},{"$f":"AC4","v":1},{"$f":"AD4/(1-SUM($Y$3:$Y$5))","v":{"$error":"#REF!"}},{"$f":"AE4","v":1},{"$f":"AD4/(1-SUM($Z$3:$Z$5))","v":{"$error":"#REF!"}},{"$f":"AF4","v":{"$error":"#REF!"}},{"$f":"AI4*90%","v":{"$error":"#REF!"}},{"$f":"AI4","v":{"$error":"#REF!"}}]
[null,"Baja California Sur","Zona 1",1,"Hij@","03","03",1948,"Transfer Bupa Internacional",1,20000000,0.95067000000000002,35000,"Si",1.01542,0.2,0.91091,2,12422.519968606075,null,null,"Suma asegurada",{"$f":"VLOOKUP('Datos Asegurado'!#REF!,Master!K3:L6,2,FALSE)","v":{"$error":"#REF!"}},"Utilidad",0.04,0.04,0.04,null,2,{"$error":"#REF!"},2,{"$error":"#REF!"},2,{"$error":"#REF!"},{"$error":"#REF!"},{"$error":"#REF!"},{"$error":"#REF!"}]
[null,"Campeche","Zona 2",0.8,"Dependiente económico","04","04",1949,null,null,50000000,1,55000,"No",0.95747000000000004,null,null,3,11563.463583180401,null,null,"Deducible",{"$f":"VLOOKUP('Datos Asegurado'!#REF!,Master!M3:O11,3,FALSE)","v":{"$error":"#REF!"}},"Total",{"$f":"SUM(Y3:Y5)","v":0.38999999999999996},{"$f":"SUM(Z3:Z5)","v":0.36},{"$f":"SUM(AA3:AA5)","v":0.27999999999999997},null,3,{"$error":"#REF!"},3,{"$error":"#REF!"},3,{"$error":"#REF!"},{"$error":"#REF!"},{"$error":"#REF!"},{"$error":"#REF!"}]
[null,"Coahuila","Zona 2",0.8,null,"05","05",1950,null,null,null,null,115000,"No",0.82316999999999996,null,null,4,10630.927064436317,null,null,"Coasegurado",{"$f":"VLOOKUP('Datos Asegurado'!#REF!,Master!P3:Q7,2,FALSE)","v":{"$error":"#REF!"}},"1-Total",{"$f":"1-Y6","v":0.6100000000000001},{"$f":"1-Z6","v":0.64},{"$f":"1-AA6","v":0.72},null,4,{"$error":"#REF!"},4,{"$error":"#REF!"},4,{"$error":"#REF!"},{"$error":"#REF!"},{"$error":"#REF!"},{"$error":"#REF!"}]
[null,"Colima","Zona 2",0.8,null,"06","06",1951,null,null,null,null,null,null,null,null,null,5,10995.294412953532,null,null,"Cobertura Extranjero: (no)",0.85492999999999997,null,null,null,null,null,5,{"$error":"#REF!"},5,{"$error":"#REF!"},5,{"$error":"#REF!"},{"$error":"#REF!"},{"$error":"#REF!"},{"$error":"#REF!"}]
[null,"Chiapas","Zona 2",0.8,null,"07","07",1952,null,null,null,null,null,null,null,null,null,6,11372.150189230695,null,null,"Reducción Honorarios: (Reducido)",0.9,null,null,null,null,null,6,{"$error":"#REF!"},6,{"$error":"#REF!"},6,{"$error":"#REF!"},{"$error":"#REF!"},{"$error":"#REF!"},{"$error":"#REF!"}]
[null,"Chihuahua","Zona 2",0.8,null,"08","08",1953,null,null,null,null,null,null,null,null,null,7,11761.922425111356,null,null,"Copago Medicamentos: (0)",1,null,null,null,null,null,7,{"$error":"#REF!"},7,{"$error":"#REF!"},7,{"$error":"#REF!"},{"$error":"#REF!"},{"$error":"#REF!"},{"$error":"#REF!"}]
[null,"Ciudad de México y área metropolitana","Zona 1",1,null,"09","09",1954,null,null,null,null,null,null,null,null,null,8,12165.053822921418,null,null,"Reduccion a Consultas: (25)",0.98,null,null,null,null,null,8,{"$error":"#REF!"},8,{"$error":"#REF!"},8,{"$error":"#REF!"},{"$error":"#REF!"},{"$error":"#REF!"},{"$error":"#REF!"}]
[null,"Estado de México","Zona 2",0.8,null,"10","10",1955,null,null,null,null,null,null,null,null,null,9,12582.002258289331,null,null,"Re. Renuncia utilidad: (Si)",0.95,null,null,null,null,null,9,{"$error":"#REF!"},9,{"$error":"#REF!"},9,{"$error":"#REF!"},{"$error":"#REF!"},{"$error":"#REF!"},{"$error":"#REF!"}]
[null,"Durango","Zona 2",0.8,null,"11","11",1956,null,null,null,null,null,null,null,null,null,10,13013.241300200078,null,null,"Re. Adicional Actuarial: (Si)",0.95,null,null,null,null,null,10,{"$error":"#REF!"},10,{"$error":"#REF!"},10,{"$error":"#REF!"},{"$error":"#REF!"},{"$error":"#REF!"},{"$error":"#REF!"}]
[null,"Guanajuato","Zona 2",0.8,null,"12","12",1957,null,null,null,null,null,null,null,null,null,11,13459.260748873632,null,null,"Factor descuento sin tipo cliente",{"$f":"W5*W6*W7*W8*W9*W10*W11*W12*W13*W4","v":{"$error":"#REF!"}},null,null,null,null,null,11,{"$error":"#REF!"},11,{"$error":"#REF!"},11,{"$error":"#REF!"},{"$error":"#REF!"},{"$error":"#REF!"},{"$error":"#REF!"}]
[null,"Guerrero","Zona 2",0.8,null,"13",null,1958,null,null,null,null,null,null,null,null,null,12,13920.567192078823,null,null,"Factor descuento con tipo cliente",{"$f":"W3*W4*W5*W6*W7*W8*W9*W10*W11*W12*W13","v":{"$error":"#REF!"}},null,null,null,null,null,12,{"$error":"#REF!"},12,{"$error":"#REF!"},12,{"$error":"#REF!"},{"$error":"#REF!"},{"$error":"#REF!"},{"$error":"#REF!"}]
[null,"Hidalgo","Zona 2",0.8,null,"14",null,1959,null,null,null,null,null,null,null,null,null,13,14397.684580514455,null,null,null,null,null,null,null,null,null,13,{"$error":"#REF!"},13,{"$error":"#REF!"},13,{"$error":"#REF!"},{"$error":"#REF!"},{"$error":"#REF!"},{"$error":"#REF!"}]
[null,"Jalisco","Zona 1",1,null,"15",null,1960,null,null,null,null,null,null,null,null,null,14,14891.15482291118,null,null,null,null,null,null,null,null,null,14,{"$error":"#REF!"},14,{"$error":"#REF!"},14,{"$error":"#REF!"},{"$error":"#REF!"},{"$error":"#REF!"},{"$error":"#REF!"}]
[null,"Michoacán","Zona 2",0.8,null,"16",null,1961,null,null,null,null,null,null,null,null,null,15,15401.538401530081,null,null,null,null,null,null,null,null,null,15,{"$error":"#REF!"},15,{"$error":"#REF!"},15,{"$error":"#REF!"},{"$error":"#REF!"},{"$error":"#REF!"},{"$error":"#REF!"}]
[null,"Morelos","Zona 2",0.8,null,"17",null,1962,null,null,null,null,null,null,null,null,null,16,15929.415008757012,null,null,null,null,null,null,null,null,null,16,{"$error":"#REF!"},16,{"$error":"#REF!"},16,{"$error":"#REF!"},{"$error":"#REF!"},{"$error":"#REF!"},{"$error":"#REF!"}]
[null,"Nayarit","Zona 2",0.8,null,"18",null,1963,null,null,null,null,null,null,null,null,null,17,16475.384205515762,null,null,null,null,null,null,null,null,null,17,{"$error":"#REF!"},17,{"$error":"#REF!"},17,{"$error":"#REF!"},{"$error":"#REF!"},{"$error":"#REF!"},{"$error":"#REF!"}]
[null,"Nuevo León","Zona 1",1,null,"19",null,1964,null,null,null,null,null,null,null,null,null,18,16973.026013074697,null,null,null,null,null,null,null,null,null,18,{"$error":"#REF!"},18,{"$error":"#REF!"},18,{"$error":"#REF!"},{"$error":"#REF!"},{"$error":"#REF!"},{"$error":"#REF!"}]
[null,"Oaxaca","Zona 2",0.8,null,"20",null,1965,null,null,null,null,null,null,null,null,null,19,17712.20798378098,null,null,null,null,null,null,null,null,null,19,{"$error":"#REF!"},19,{"$error":"#REF!"},19,{"$error":"#REF!"},{"$error":"#REF!"},{"$error":"#REF!"},{"$error":"#REF!"}]
[null,"Puebla","Zona 2",0.8,null,"21",null,1966,null,null,null,null,null,null,null,null,null,20,18521.788237411674,null,null,null,null,null,null,null,null,null,20,{"$error":"#REF!"},20,{"$error":"#REF!"},20,{"$error":"#REF!"},{"$error":"#REF!"},{"$error":"#REF!"},{"$error":"#REF!"}]
[null,"Querétaro","Zona 2",0.8,null,"22",null,1967,null,null,null,null,null,null,null,null,null,21,19331.368491042362,null,null,null,null,null,null,null,null,null,21,{"$error":"#REF!"},21,{"$error":"#REF!"},21,{"$error":"#REF!"},{"$error":"#REF!"},{"$error":"#REF!"},{"$error":"#REF!"}]
[null,"Quintana Roo zona 1","Zona 1",1,null,"23","s",1968,null,null,null,null,null,null,null,null,null,22,20091.669946625963,null,null,null,null,null,null,null,null,null,22,{"$error":"#REF!"},22,{"$error":"#REF!"},22,{"$error":"#REF!"},{"$error":"#REF!"},{"$error":"#REF!"},{"$error":"#REF!"}]
[null,"Quintana Roo zona 2","Zona 2",0.8,null,"24",null,1969,null,null,null,null,null,null,null,null,null,23,20957.56882659618,null,null,null,null,null,null,null,null,null,23,{"$error":"#REF!"},23,{"$error":"#REF!"},23,{"$error":"#REF!"},{"$error":"#REF!"},{"$error":"#REF!"},{"$error":"#REF!"}]
[null,"San Luis Potosí","Zona 2",0.8,null,"25",null,1970,null,null,null,null,null,null,null,null,null,24,21767.149080226867,null,null,null,null,null,null,null,null,null,24,{"$error":"#REF!"},24,{"$error":"#REF!"},24,{"$error":"#REF!"},{"$error":"#REF!"},{"$error":"#REF!"},{"$error":"#REF!"}]
[null,"Sinaloa","Zona 2",0.8,null,"26",null,1971,null,null,null,null,null,null,null,null,null,25,22330.335343622126,null,null,null,null,null,null,null,null,null,25,{"$error":"#REF!"},25,{"$error":"#REF!"},25,{"$error":"#REF!"},{"$error":"#REF!"},{"$error":"#REF!"},{"$error":"#REF!"}]
[null,"Sonora","Zona 1",1,null,"27",null,1972,null,null,null,null,null,null,null,null,null,26,23196.234223592342,null,null,null,null,null,null,null,null,null,26,{"$error":"#REF!"},26,{"$error":"#REF!"},26,{"$error":"#REF!"},{"$error":"#REF!"},{"$error":"#REF!"},{"$error":"#REF!"}]
[null,"Tabasco","Zona 2",0.8,null,"28",null,1973,null,null,null,null,null,null,null,null,null,27,24033.973790392793,null,null,null,null,null,null,null,null,null,27,{"$error":"#REF!"},27,{"$error":"#REF!"},27,{"$error":"#REF!"},{"$error":"#REF!"},{"$error":"#REF!"},{"$error":"#REF!"}]
{"$rows_left_out":57}